{"text_format":"3","workbook":"xlsx","n_sheets":18,"sheets":["Results","Instructions","Round Draws","Armees","Module1","Module2","Module3","Module4","Module5","Round 1","Round 2","Round 3","Round 4","Round 5","Round 6","Round 7","Round 8","Sheet1"],"not_rendered":{"images":8,"macros":1,"defined_names":8},"unopened":[{"sheet":"Module1","index":4,"reason":"part_missing"},{"sheet":"Module2","index":5,"reason":"part_missing"},{"sheet":"Module3","index":6,"reason":"part_missing"},{"sheet":"Module4","index":7,"reason":"part_missing"},{"sheet":"Module5","index":8,"reason":"part_missing"}],"read":"whole","date_system":"1900"}

{"sheet":"Results","index":0,"n_rows":117,"n_cols":68,"rows_kept":117,"merged":[[1,64,1,67],[2,1,2,2],[2,4,2,5],[3,1,3,2],[3,4,3,5]]}
["V2.1",null,null,"L'Art de la Guerre - Result Sheet"]
[{"$nulls":64},"Umpire Zone"]
["Tournament",null,null,"Date",null,null,"# Players (8 - 52)"]
["Theme","Open Theme",null,"Country","UK",null,"# Rounds (3 - 8)"]
[]
[{"$nulls":11},"Rnd 1",{"$nulls":6},"Rnd 2",{"$nulls":6},"Rnd 3",{"$nulls":6},"Rnd 4",{"$nulls":6},"Rnd 5",{"$nulls":6},"Rnd 6",{"$nulls":6},"Rnd 7",{"$nulls":6},"Rnd 8",{"$nulls":3},"Team Total","Opponents","Ex-Aequo","Ajustment"]
{"$rows_left_out":77}
{"sheet":"Instructions","index":1,"n_rows":26,"n_cols":1,"rows_kept":26}
["L'Art de la Guerre"]
["The results excel file"]
[]
["The excel file is used to help to pair up and to record Tournament results for L'Art de la Guerre. "]
["Using this spreadsheet allows the Tournament Organiser to submit the results for automatic inclusion in the global tournament database. This generates ELO rankings for players across the world."]
[]
{"$rows_left_out":21}
{"sheet":"Round Draws","index":2,"n_rows":2,"n_cols":2,"rows_kept":2,"hidden":true}
[]
[null,"Appariements du tour 4"]

{"sheet":"Armees","index":3,"n_rows":300,"n_cols":2,"rows_kept":300}
[1,"Sumer and Akkad"]
[2,"Sumerian Successor"]
[3,"Amorite Highlanders"]
[4,"Elamite"]
[5,"Old Assyrian and Babylonian"]
[6,"Kassite Babylonian"]
{"$rows_left_out":295}
{"sheet":"Round 1","index":9,"n_rows":63,"n_cols":13,"rows_kept":63}
[null,null,"First Name","Surname","Club",{"$nulls":3},"First Name","Surname","Club"]
["Round 1 Draw",null,{"$f":"Results!B3","v":0}]
[null,null,{"$f":"Results!B4","v":"Open Theme"}]
[{"$nulls":12},"VALID?"]
[null,{"$f":"Results!A8","v":1},{"$f":"Results!C8","v":0},{"$f":"Results!B8","v":"Team 1 A"},{"$f":"Results!D8","v":0},{"$f":"Results!G8","v":""},"- vs -",{"$f":"VLOOKUP(B5,Results!$A$8:AG60,9,)","v":0},{"$f":"VLOOKUP(H5,Results!A$8:G60,3,FALSE)","v":{"$error":"#N/A"}},{"$f":"VLOOKUP(H5,Results!$A$8:G60,2,FALSE)","v":{"$error":"#N/A"}},{"$f":"VLOOKUP(H5,Results!$A$8:G60,4,FALSE)","v":{"$error":"#N/A"}},{"$f":"VLOOKUP(H5,Results!$A$8:G60,7,FALSE)","v":{"$error":"#N/A"}},{"$f":"VLOOKUP(H5,$B$4:B5,1,FALSE)","v":{"$error":"#N/A"}}]
[null,{"$f":"Results!A9","v":2},{"$f":"Results!C9","v":0},{"$f":"Results!B9","v":"Team 1 B"},{"$f":"Results!D9","v":0},{"$f":"Results!G9","v":""},"- vs -",{"$f":"VLOOKUP(B6,Results!$A$8:AG61,9,)","v":0},{"$f":"VLOOKUP(H6,Results!A$8:G61,3,)","v":{"$error":"#N/A"}},{"$f":"VLOOKUP(H6,Results!$A$8:G61,2,FALSE)","v":{"$error":"#N/A"}},{"$f":"VLOOKUP(H6,Results!$A$8:G61,4,FALSE)","v":{"$error":"#N/A"}},{"$f":"VLOOKUP(H6,Results!$A$8:G61,7,FALSE)","v":{"$error":"#N/A"}},{"$f":"VLOOKUP(H6,$B$4:B6,1,FALSE)","v":{"$error":"#N/A"}}]
{"$rows_left_out":58}
{"sheet":"Round 2","index":10,"n_rows":63,"n_cols":13,"rows_kept":63}
[null,null,"First Name","Surname","Club",{"$nulls":3},"First Name","Surname","Club"]
["Round 2 Draw",null,{"$f":"Results!B3","v":0}]
[null,null,{"$f":"Results!B4","v":"Open Theme"}]
[{"$nulls":12},"VALID?"]
[null,{"$f":"Results!A8","v":1},{"$f":"Results!C8","v":0},{"$f":"Results!B8","v":"Team 1 A"},{"$f":"Results!D8","v":0},{"$f":"Results!G8","v":""},"- vs -",{"$f":"VLOOKUP(B5,Results!$A$8:$AG$60,16,FALSE)","v":0},{"$f":"VLOOKUP(H5,Results!A$8:$G$60,3,FALSE)","v":{"$error":"#N/A"}},{"$f":"VLOOKUP(H5,Results!$A$8:$G$60,2,FALSE)","v":{"$error":"#N/A"}},{"$f":"VLOOKUP(H5,Results!$A$8:$G$60,4,FALSE)","v":{"$error":"#N/A"}},{"$f":"VLOOKUP(H5,Results!$A$8:$G$60,7,FALSE)","v":{"$error":"#N/A"}},{"$f":"VLOOKUP(H5,$B$4:B5,1,FALSE)","v":{"$error":"#N/A"}}]
[null,{"$f":"Results!A9","v":2},{"$f":"Results!C9","v":0},{"$f":"Results!B9","v":"Team 1 B"},{"$f":"Results!D9","v":0},{"$f":"Results!G9","v":""},"- vs -",{"$f":"VLOOKUP(B6,Results!$A$8:$AG$60,16,FALSE)","v":0},{"$f":"VLOOKUP(H6,Results!A$8:$G$60,3,FALSE)","v":{"$error":"#N/A"}},{"$f":"VLOOKUP(H6,Results!$A$8:$G$60,2,FALSE)","v":{"$error":"#N/A"}},{"$f":"VLOOKUP(H6,Results!$A$8:$G$60,4,FALSE)","v":{"$error":"#N/A"}},{"$f":"VLOOKUP(H6,Results!$A$8:$G$60,7,FALSE)","v":{"$error":"#N/A"}},{"$f":"VLOOKUP(H6,$B$4:B6,1,FALSE)","v":{"$error":"#N/A"}}]
{"$rows_left_out":58}
{"sheet":"Round 3","index":11,"n_rows":63,"n_cols":13,"rows_kept":63}
[null,null,"First Name","Surname","Club",{"$nulls":3},"First Name","Surname","Club"]
["Round 3 Draw",null,{"$f":"Results!B3","v":0}]
[null,null,{"$f":"Results!B4","v":"Open Theme"}]
[{"$nulls":12},"VALID?"]
[null,{"$f":"Results!A8","v":1},{"$f":"Results!C8","v":0},{"$f":"Results!B8","v":"Team 1 A"},{"$f":"Results!D8","v":0},{"$f":"Results!G8","v":""},"- vs -",{"$f":"VLOOKUP(B5,Results!$A$8:$AG$60,23,FALSE)","v":0},{"$f":"VLOOKUP(H5,Results!A$8:$G$60,3,FALSE)","v":{"$error":"#N/A"}},{"$f":"VLOOKUP(H5,Results!$A$8:$G$60,2,FALSE)","v":{"$error":"#N/A"}},{"$f":"VLOOKUP(H5,Results!$A$8:$G$60,4,FALSE)","v":{"$error":"#N/A"}},{"$f":"VLOOKUP(H5,Results!$A$8:$G$60,7,FALSE)","v":{"$error":"#N/A"}},{"$f":"VLOOKUP(H5,$B$4:B5,1,FALSE)","v":{"$error":"#N/A"}}]
[null,{"$f":"Results!A9","v":2},{"$f":"Results!C9","v":0},{"$f":"Results!B9","v":"Team 1 B"},{"$f":"Results!D9","v":0},{"$f":"Results!G9","v":""},"- vs -",{"$f":"VLOOKUP(B6,Results!$A$8:$AG$60,23,FALSE)","v":0},{"$f":"VLOOKUP(H6,Results!A$8:$G$60,3,FALSE)","v":{"$error":"#N/A"}},{"$f":"VLOOKUP(H6,Results!$A$8:$G$60,2,FALSE)","v":{"$error":"#N/A"}},{"$f":"VLOOKUP(H6,Results!$A$8:$G$60,4,FALSE)","v":{"$error":"#N/A"}},{"$f":"VLOOKUP(H6,Results!$A$8:$G$60,7,FALSE)","v":{"$error":"#N/A"}},{"$f":"VLOOKUP(H6,$B$4:B6,1,FALSE)","v":{"$error":"#N/A"}}]
{"$rows_left_out":58}
{"sheet":"Round 4","index":12,"n_rows":63,"n_cols":13,"rows_kept":63}
[null,null,"First Name","Surname","Club",{"$nulls":3},"First Name","Surname","Club"]
["Round 4 Draw",null,{"$f":"Results!B3","v":0}]
[null,null,{"$f":"Results!B4","v":"Open Theme"}]
[{"$nulls":12},"VALID?"]
[null,{"$f":"Results!A8","v":1},{"$f":"Results!C8","v":0},{"$f":"Results!B8","v":"Team 1 A"},{"$f":"Results!D8","v":0},{"$f":"Results!G8","v":""},"- vs -",{"$f":"VLOOKUP(B5,Results!$A$8:$AG$60,30,FALSE)","v":0},{"$f":"VLOOKUP(H5,Results!A$8:$G$60,3,FALSE)","v":{"$error":"#N/A"}},{"$f":"VLOOKUP(H5,Results!$A$8:$G$60,2,FALSE)","v":{"$error":"#N/A"}},{"$f":"VLOOKUP(H5,Results!$A$8:$G$60,4,FALSE)","v":{"$error":"#N/A"}},{"$f":"VLOOKUP(H5,Results!$A$8:$G$60,7,FALSE)","v":{"$error":"#N/A"}},{"$f":"VLOOKUP(H5,$B$4:B5,1,FALSE)","v":{"$error":"#N/A"}}]
[null,{"$f":"Results!A9","v":2},{"$f":"Results!C9","v":0},{"$f":"Results!B9","v":"Team 1 B"},{"$f":"Results!D9","v":0},{"$f":"Results!G9","v":""},"- vs -",{"$f":"VLOOKUP(B6,Results!$A$8:$AG$60,30,FALSE)","v":0},{"$f":"VLOOKUP(H6,Results!A$8:$G$60,3,FALSE)","v":{"$error":"#N/A"}},{"$f":"VLOOKUP(H6,Results!$A$8:$G$60,2,FALSE)","v":{"$error":"#N/A"}},{"$f":"VLOOKUP(H6,Results!$A$8:$G$60,4,FALSE)","v":{"$error":"#N/A"}},{"$f":"VLOOKUP(H6,Results!$A$8:$G$60,7,FALSE)","v":{"$error":"#N/A"}},{"$f":"VLOOKUP(H6,$B$4:B6,1,FALSE)","v":{"$error":"#N/A"}}]
{"$rows_left_out":58}
{"sheet":"Round 5","index":13,"n_rows":63,"n_cols":13,"rows_kept":63}
[null,null,"First Name","Surname","Club",{"$nulls":3},"First Name","Surname","Club"]
["Round 5 Draw",null,{"$f":"Results!B3","v":0}]
[null,null,{"$f":"Results!B4","v":"Open Theme"}]
[{"$nulls":12},"VALID?"]
[null,{"$f":"Results!A8","v":1},{"$f":"Results!C8","v":0},{"$f":"Results!B8","v":"Team 1 A"},{"$f":"Results!D8","v":0},{"$f":"Results!G8","v":""},"- vs -",{"$f":"VLOOKUP(B5,Results!$A$8:AK59,37,FALSE)","v":0},{"$f":"VLOOKUP(H5,Results!A$8:G60,3,FALSE)","v":{"$error":"#N/A"}},{"$f":"VLOOKUP(H5,Results!$A$8:G60,2,FALSE)","v":{"$error":"#N/A"}},{"$f":"VLOOKUP(H5,Results!$A$8:G60,4,FALSE)","v":{"$error":"#N/A"}},{"$f":"VLOOKUP(H5,Results!$A$8:G60,7,FALSE)","v":{"$error":"#N/A"}},{"$f":"VLOOKUP(H5,$B$4:B5,1,FALSE)","v":{"$error":"#N/A"}}]
[null,{"$f":"Results!A9","v":2},{"$f":"Results!C9","v":0},{"$f":"Results!B9","v":"Team 1 B"},{"$f":"Results!D9","v":0},{"$f":"Results!G9","v":""},"- vs -",{"$f":"VLOOKUP(B6,Results!$A$8:AK60,37,FALSE)","v":0},{"$f":"VLOOKUP(H6,Results!A$8:G61,3,FALSE)","v":{"$error":"#N/A"}},{"$f":"VLOOKUP(H6,Results!$A$8:G61,2,FALSE)","v":{"$error":"#N/A"}},{"$f":"VLOOKUP(H6,Results!$A$8:G61,4,FALSE)","v":{"$error":"#N/A"}},{"$f":"VLOOKUP(H6,Results!$A$8:G61,7,FALSE)","v":{"$error":"#N/A"}},{"$f":"VLOOKUP(H6,$B$4:B6,1,FALSE)","v":{"$error":"#N/A"}}]
{"$rows_left_out":58}
{"sheet":"Round 6","index":14,"n_rows":63,"n_cols":13,"rows_kept":63}
[null,null,"First Name","Surname","Club",{"$nulls":3},"First Name","Surname","Club"]
["Round 5 Draw",null,{"$f":"Results!B3","v":0}]
[null,null,{"$f":"Results!B4","v":"Open Theme"}]
[{"$nulls":12},"VALID?"]
[null,{"$f":"Results!A8","v":1},{"$f":"Results!C8","v":0},{"$f":"Results!B8","v":"Team 1 A"},{"$f":"Results!D8","v":0},{"$f":"Results!G8","v":""},"- vs -",{"$f":"VLOOKUP(B5,Results!$A$8:AR59,44,FALSE)","v":0},{"$f":"VLOOKUP(H5,Results!A$8:G60,3,FALSE)","v":{"$error":"#N/A"}},{"$f":"VLOOKUP(H5,Results!$A$8:G60,2,FALSE)","v":{"$error":"#N/A"}},{"$f":"VLOOKUP(H5,Results!$A$8:G60,4,FALSE)","v":{"$error":"#N/A"}},{"$f":"VLOOKUP(H5,Results!$A$8:G60,7,FALSE)","v":{"$error":"#N/A"}},{"$f":"VLOOKUP(H5,$B$4:B5,1,FALSE)","v":{"$error":"#N/A"}}]
[null,{"$f":"Results!A9","v":2},{"$f":"Results!C9","v":0},{"$f":"Results!B9","v":"Team 1 B"},{"$f":"Results!D9","v":0},{"$f":"Results!G9","v":""},"- vs -",{"$f":"VLOOKUP(B6,Results!$A$8:AR60,44,FALSE)","v":0},{"$f":"VLOOKUP(H6,Results!A$8:G61,3,FALSE)","v":{"$error":"#N/A"}},{"$f":"VLOOKUP(H6,Results!$A$8:G61,2,FALSE)","v":{"$error":"#N/A"}},{"$f":"VLOOKUP(H6,Results!$A$8:G61,4,FALSE)","v":{"$error":"#N/A"}},{"$f":"VLOOKUP(H6,Results!$A$8:G61,7,FALSE)","v":{"$error":"#N/A"}},{"$f":"VLOOKUP(H6,$B$4:B6,1,FALSE)","v":{"$error":"#N/A"}}]
{"$rows_left_out":58}
{"sheet":"Round 7","index":15,"n_rows":63,"n_cols":13,"rows_kept":63}
[null,null,"First Name","Surname","Club",{"$nulls":3},"First Name","Surname","Club"]
["Round 5 Draw",null,{"$f":"Results!B3","v":0}]
[null,null,{"$f":"Results!B4","v":"Open Theme"},{"$nulls":5},"`"]
[{"$nulls":12},"VALID?"]
[null,{"$f":"Results!A8","v":1},{"$f":"Results!C8","v":0},{"$f":"Results!B8","v":"Team 1 A"},{"$f":"Results!D8","v":0},{"$f":"Results!G8","v":""},"- vs -",{"$f":"VLOOKUP(B5,Results!$A$8:AY59,51,FALSE)","v":0},{"$f":"VLOOKUP(H5,Results!A$8:G60,3,FALSE)","v":{"$error":"#N/A"}},{"$f":"VLOOKUP(H5,Results!$A$8:G60,2,FALSE)","v":{"$error":"#N/A"}},{"$f":"VLOOKUP(H5,Results!$A$8:G60,4,FALSE)","v":{"$error":"#N/A"}},{"$f":"VLOOKUP(H5,Results!$A$8:G60,7,FALSE)","v":{"$error":"#N/A"}},{"$f":"VLOOKUP(H5,$B$4:B5,1,FALSE)","v":{"$error":"#N/A"}}]
[null,{"$f":"Results!A9","v":2},{"$f":"Results!C9","v":0},{"$f":"Results!B9","v":"Team 1 B"},{"$f":"Results!D9","v":0},{"$f":"Results!G9","v":""},"- vs -",{"$f":"VLOOKUP(B6,Results!$A$8:AY60,51,FALSE)","v":0},{"$f":"VLOOKUP(H6,Results!A$8:G61,3,FALSE)","v":{"$error":"#N/A"}},{"$f":"VLOOKUP(H6,Results!$A$8:G61,2,FALSE)","v":{"$error":"#N/A"}},{"$f":"VLOOKUP(H6,Results!$A$8:G61,4,FALSE)","v":{"$error":"#N/A"}},{"$f":"VLOOKUP(H6,Results!$A$8:G61,7,FALSE)","v":{"$error":"#N/A"}},{"$f":"VLOOKUP(H6,$B$4:B6,1,FALSE)","v":{"$error":"#N/A"}}]
{"$rows_left_out":58}
{"sheet":"Round 8","index":16,"n_rows":90,"n_cols":13,"rows_kept":90}
[null,null,"First Name","Surname","Club",{"$nulls":3},"First Name","Surname","Club"]
["Round 5 Draw",null,{"$f":"Results!B3","v":0}]
[null,null,{"$f":"Results!B4","v":"Open Theme"}]
[{"$nulls":12},"VALID?"]
[null,{"$f":"Results!A8","v":1},{"$f":"Results!C8","v":0},{"$f":"Results!B8","v":"Team 1 A"},{"$f":"Results!D8","v":0},{"$f":"Results!G8","v":""},"- vs -",{"$f":"VLOOKUP(B5,Results!$A$8:BF66,58,FALSE)","v":0},{"$f":"VLOOKUP(H5,Results!A$8:G60,3,FALSE)","v":{"$error":"#N/A"}},{"$f":"VLOOKUP(H5,Results!$A$8:G60,2,FALSE)","v":{"$error":"#N/A"}},{"$f":"VLOOKUP(H5,Results!$A$8:G60,4,FALSE)","v":{"$error":"#N/A"}},{"$f":"VLOOKUP(H5,Results!$A$8:G60,7,FALSE)","v":{"$error":"#N/A"}},{"$f":"VLOOKUP(H5,$B$4:B5,1,FALSE)","v":{"$error":"#N/A"}}]
[null,{"$f":"Results!A9","v":2},{"$f":"Results!C9","v":0},{"$f":"Results!B9","v":"Team 1 B"},{"$f":"Results!D9","v":0},{"$f":"Results!G9","v":""},"- vs -",{"$f":"VLOOKUP(B6,Results!$A$8:BF67,58,FALSE)","v":0},{"$f":"VLOOKUP(H6,Results!A$8:G61,3,FALSE)","v":{"$error":"#N/A"}},{"$f":"VLOOKUP(H6,Results!$A$8:G61,2,FALSE)","v":{"$error":"#N/A"}},{"$f":"VLOOKUP(H6,Results!$A$8:G61,4,FALSE)","v":{"$error":"#N/A"}},{"$f":"VLOOKUP(H6,Results!$A$8:G61,7,FALSE)","v":{"$error":"#N/A"}},{"$f":"VLOOKUP(H6,$B$4:B6,1,FALSE)","v":{"$error":"#N/A"}}]
{"$rows_left_out":85}
{"sheet":"Sheet1","index":17,"n_rows":20,"n_cols":6,"rows_kept":20}
[]
[]
[{"$nulls":3},"Athletico Madaxeman","Adam Worsdale","Ghaznavid"]
[{"$nulls":3},"Athletico Madaxeman","Tim Porter","Delhi Sultanate"]
[{"$nulls":3},"Athletico Madaxeman","Howard Gray","Parthian"]
[{"$nulls":3},"Two Heffalumps and a Woozle","Dave Allen","Kushan"]
{"$rows_left_out":14}