{"text_format":"1","workbook":"xlsx","n_sheets":15,"sheets":["Results","Instructions","Round Draws","Armies","Module1","Module2","Module3","Module4","Module5","Round 1","Round 2","Round 3","Round 4","Round 5","Round 6"],"not_rendered":{"charts":0,"images":13,"macros":1,"external_links":0,"defined_names":3,"comments":0,"pivot_tables":0},"unopened":[{"sheet":"Module1","index":4,"reason":"part_missing"},{"sheet":"Module2","index":5,"reason":"part_missing"},{"sheet":"Module3","index":6,"reason":"part_missing"},{"sheet":"Module4","index":7,"reason":"part_missing"},{"sheet":"Module5","index":8,"reason":"part_missing"}],"bounds":{"document_bytes":16777216,"sheet_cells":100000,"rows_first":2000,"rows_last":500,"rows_between":2000,"halvings":0,"cell_chars":16384,"cell_head_chars":4096},"cells_cut":0,"cells_raw":0,"read":"whole","date_system":"1900"}

{"sheet":"Results","index":0,"n_rows":116,"n_cols":54,"rows_kept":116,"cut":false,"hidden":false,"merged":[[1,51,1,53],[2,4,2,5],[3,4,3,5],[2,1,2,2],[3,1,3,2]]}
["V2.0",null,null,"L'Art de la Guerre - Result Sheet"]
[null,null,null,null,null,null,null,null,null,null,null,null,null,null,null,null,null,null,null,null,null,null,null,null,null,null,null,null,null,null,null,null,null,null,null,null,null,null,null,null,null,null,null,null,null,null,null,null,null,null,null,"Umpire Zone"]
["Tournament","Warfare",null,"Date","2017-11-17",null,"# Players (4 - 65)",44]
["Theme","Période Ancienne",null,"Country","UK",null,"# Rounds (3 - 6)",5]
[]
[null,null,null,null,null,null,null,null,null,null,null,"Tour 1",null,null,null,null,null,null,"Tour 2",null,null,null,null,null,null,"Tour 3",null,null,null,null,null,null,"Tour 4",null,null,null,null,null,null,"Tour 5",null,null,null,null,null,null,"Tour 6",null,null,null,null,"Opponents","Ex-Aequo","Ajustment"]
["ID","Surname","First Name","Club","Points","N°","Army","Units","ID ","Opponent",null,"Result",null,"Losses","Points","ID ","Opponent",null,"Result",null,"Losses","Points","ID ","Opponent",null,"Result",null,"Losses","Points","ID ","Opponent",null,"Result",null,"Losses","Points","ID ","Opponent",null,"Result",null,"Losses","Points","ID ","Oppoenent",null,"Result",null,"Losses","Points",null,"Scores",null,"Points"]
[null,null,null,null,{"$f":"O8+V8+AC8+AJ8+AQ8+AX8+BB8","v":0},null,{"$f":"IF($F8<>\"\",VLOOKUP(F8,Armies!$A$1:$B$283,2,FALSE),\"\")","v":""},null,null,{"$f":"IF(I8<>\"\",VLOOKUP(I8,$A$8:$C$72,2,FALSE),\"\")","v":""},{"$f":"IF(I8<>\"\",IF(I8=$A8,\"ERR\",IF(OR(I8=$P8,I8=$W8,I8=$AD8,I8=$AK8,I8=$AR8),\"DUP\",IF(ISNA(VLOOKUP(I8,$A$8:$A$72,1,FALSE)),\"ERR\",IF(COUNTIF($I$8:$I$72,I8)>1,\"ERR\",IF($D8=VLOOKUP(I8,$A$8:$D$72,4,FALSE),\"CLUB\",\"OK\"))))),\"\")","v":""},null,{"$f":"IF(L8<>\"\",IF(L8=\"Victoire\",IF(VLOOKUP(I8,$A$8:$L$72,12,FALSE)=\"Défaite\",\"OK\",\"ERR\"),IF(L8=\"Défaite\",IF(VLOOKUP(I8,$A$8:$L$72,12,FALSE)=\"Victoire\",\"OK\",\"ERR\"),IF(L8=\"Nul\",IF(VLOOKUP(I8,$A$8:$L$72,12,FALSE)=\"Nul\",\"OK\",\"ERR\")))),\"\")","v":""},null,{"$f":"IF(L8=\"Victoire\",100-ROUNDDOWN(20*N8/$H8,0),\nIF(L8=\"Défaite\",10+ROUNDDOWN(20*VLOOKUP(I8,$A$8:$N$72,14,FALSE)/VLOOKUP(I8,$A$8:$H$72,8,FALSE),0),\nIF(AND(L8=\"Nul\",$N8<>$H8),40+(2*ROUNDDOWN(10*VLOOKUP(I8,$A$8:$N$72,14,FALSE)/VLOOKUP(I8,$A$8:$H$72,8,FALSE),0)-ROUNDDOWN(10*N8/$H8,0)),IF(AND(L8=\"Nul\",$N8=$H8),58,0))))","v":0},null,{"$f":"IF(P8<>\"\",VLOOKUP(P8,$A$8:$C$72,2,FALSE),\"\")","v":""},{"$f":"IF(P8<>\"\",IF(P8=$A8,\"ERR\",IF(OR(P8=$I8,P8=$W8,P8=$AD8,P8=$AK8,P8=$AR8),\"DUP\",IF(ISNA(VLOOKUP(P8,$A$8:$A$72,1,FALSE)),\"ERR\",IF(COUNTIF($I$8:$I$72,P8)>1,\"ERR\",IF($D8=VLOOKUP(P8,$A$8:$D$72,4,FALSE),\"CLUB\",\"OK\"))))),\"\")","v":""},null,{"$f":"IF(S8<>\"\",IF(S8=\"Victoire\",IF(VLOOKUP(P8,$A$8:$AO$72,19,FALSE)=\"Défaite\",\"OK\",\"ERR\"),IF(S8=\"Défaite\",IF(VLOOKUP(P8,$A$8:$AO$72,19,FALSE)=\"Victoire\",\"OK\",\"ERR\"),IF(S8=\"Nul\",IF(VLOOKUP(P8,$A$8:$AO$72,19,FALSE)=\"Nul\",\"OK\",\"ERR\")))),\"\")","v":""},null,{"$f":"IF(S8=\"Victoire\",100-ROUNDDOWN(20*U8/$H8,0),\nIF(S8=\"Défaite\",10+ROUNDDOWN(20*VLOOKUP(P8,$A$8:$AO$72,21,FALSE)/VLOOKUP(P8,$A$8:$H$72,8,FALSE),0),\nIF(AND(S8=\"Nul\",$U8<>$H8),40+(2*ROUNDDOWN(10*VLOOKUP(P8,$A$8:$AO$72,21,FALSE)/VLOOKUP(P8,$A$8:$H$72,8,FALSE),0)-ROUNDDOWN(10*U8/$H8,0)),IF(AND(S8=\"Nul\",$U8=$H8),58,0))))","v":0},null,{"$f":"IF(W8<>\"\",VLOOKUP(W8,$A$8:$C$72,2,FALSE),\"\")","v":""},{"$f":"IF(W8<>\"\",IF(W8=$A8,\"ERR\",IF(OR(W8=$P8,W8=$I8,W8=$AD8,W8=$AK8,W8=$AR8),\"DUP\",IF(ISNA(VLOOKUP(W8,$A$8:$A$72,1,FALSE)),\"ERR\",IF(COUNTIF($I$8:$I$72,W8)>1,\"ERR\",IF($D8=VLOOKUP(W8,$A$8:$D$72,4,FALSE),\"CLUB\",\"OK\"))))),\"\")","v":""},null,{"$f":"IF(Z8<>\"\",IF(Z8=\"Victoire\",IF(VLOOKUP(W8,$A$8:$AO$72,26,FALSE)=\"Défaite\",\"OK\",\"ERR\"),IF(Z8=\"Défaite\",IF(VLOOKUP(W8,$A$8:$AO$72,26,FALSE)=\"Victoire\",\"OK\",\"ERR\"),IF(Z8=\"Nul\",IF(VLOOKUP(W8,$A$8:$AO$72,26,FALSE)=\"Nul\",\"OK\",\"ERR\")))),\"\")","v":""},null,{"$f":"IF(Z8=\"Victoire\",100-ROUNDDOWN(20*AB8/$H8,0),\nIF(Z8=\"Défaite\",10+ROUNDDOWN(20*VLOOKUP(W8,$A$8:$AO$72,28,FALSE)/VLOOKUP(W8,$A$8:$H$72,8,FALSE),0),\nIF(AND(Z8=\"Nul\",$AB8<>$H8),40+(2*ROUNDDOWN(10*VLOOKUP(W8,$A$8:$AO$72,28,FALSE)/VLOOKUP(W8,$A$8:$H$72,8,FALSE),0)-ROUNDDOWN(10*AB8/$H8,0)),IF(AND(Z8=\"Nul\",$AB8=$H8),58,0))))","v":0},null,{"$f":"IF(AD8<>\"\",VLOOKUP(AD8,$A$8:$C$72,2,FALSE),\"\")","v":""},{"$f":"IF(AD8<>\"\",IF(AD8=$A8,\"ERR\",IF(OR(AD8=$P8,AD8=$W8,AD8=$I8,AD8=$AK8,AD8=$AR8),\"DUP\",IF(ISNA(VLOOKUP(AD8,$A$8:$A$72,1,FALSE)),\"ERR\",IF(COUNTIF($I$8:$I$72,AD8)>1,\"ERR\",IF($D8=VLOOKUP(AD8,$A$8:$D$72,4,FALSE),\"CLUB\",\"OK\"))))),\"\")","v":""},null,{"$f":"IF(AG8<>\"\",IF(AG8=\"Victoire\",IF(VLOOKUP(AD8,$A$8:$AO$72,33,FALSE)=\"Défaite\",\"OK\",\"ERR\"),IF(AG8=\"Défaite\",IF(VLOOKUP(AD8,$A$8:$AO$72,33,FALSE)=\"Victoire\",\"OK\",\"ERR\"),IF(AG8=\"Nul\",IF(VLOOKUP(AD8,$A$8:$AO$72,33,FALSE)=\"Nul\",\"OK\",\"ERR\")))),\"\")","v":""},null,{"$f":"IF(AG8=\"Victoire\",100-ROUNDDOWN(20*AI8/$H8,0),\nIF(AG8=\"Défaite\",10+ROUNDDOWN(20*VLOOKUP(AD8,$A$8:$AO$72,35,FALSE)/VLOOKUP(AD8,$A$8:$H$72,8,FALSE),0),\nIF(AND(AG8=\"Nul\",$AI8<>$H8),40+(2*ROUNDDOWN(10*VLOOKUP(AD8,$A$8:$AO$72,35,FALSE)/VLOOKUP(AD8,$A$8:$H$72,8,FALSE),0)-ROUNDDOWN(10*AI8/$H8,0)),IF(AND(AG8=\"Nul\",$AI8=$H8),58,0))))","v":0},null,{"$f":"IF(AK8<>\"\",VLOOKUP(AK8,$A$8:$C$72,2,FALSE),\"\")","v":""},{"$f":"IF(AK8<>\"\",IF(AK8=$A8,\"ERR\",IF(OR(AK8=$P8,AK8=$W8,AK8=$AD8,AK8=$I8,AK8=$AR8),\"DUP\",IF(ISNA(VLOOKUP(AK8,$A$8:$A$72,1,FALSE)),\"ERR\",IF(COUNTIF($I$8:$I$72,AK8)>1,\"ERR\",IF($D8=VLOOKUP(AK8,$A$8:$D$72,4,FALSE),\"CLUB\",\"OK\"))))),\"\")","v":""},null,{"$f":"IF(AN8<>\"\",IF(AN8=\"Victoire\",IF(VLOOKUP(AK8,$A$8:$AO$72,40,FALSE)=\"Défaite\",\"OK\",\"ERR\"),IF(AN8=\"Défaite\",IF(VLOOKUP(AK8,$A$8:$AO$72,40,FALSE)=\"Victoire\",\"OK\",\"ERR\"),IF(AN8=\"Nul\",IF(VLOOKUP(AK8,$A$8:$AO$72,40,FALSE)=\"Nul\",\"OK\",\"ERR\")))),\"\")","v":""},null,{"$f":"IF(AN8=\"Victoire\",100-ROUNDDOWN(20*AP8/$H8,0),\nIF(AN8=\"Défaite\",10+ROUNDDOWN(20*VLOOKUP(AK8,$A$8:$BG$72,42,FALSE)/VLOOKUP(AK8,$A$8:$H$72,8,FALSE),0),\nIF(AND(AN8=\"Nul\",$AP8<>$H8),40+(2*ROUNDDOWN(10*VLOOKUP(AK8,$A$8:$BG$72,42,FALSE)/VLOOKUP(AK8,$A$8:$H$72,8,FALSE),0)-ROUNDDOWN(10*AP8/$H8,0)),IF(AND(AN8=\"Nul\",$AP8=$H8),58,0))))","v":0},null,{"$f":"IF(AR8<>\"\",VLOOKUP(AR8,$A$8:$C$72,2,FALSE),\"\")","v":""},{"$f":"IF(AR8<>\"\",IF(AR8=$A8,\"ERR\",IF(OR(AR8=$P8,AR8=$W8,AR8=$AD8,AR8=$I8,AR8=$AK8),\"DUP\",IF(ISNA(VLOOKUP(AR8,$A$8:$A$72,1,FALSE)),\"ERR\",IF(COUNTIF($I$8:$I$72,AR8)>1,\"ERR\",IF($D8=VLOOKUP(AR8,$A$8:$D$72,4,FALSE),\"CLUB\",\"OK\"))))),\"\")","v":""},null,{"$f":"IF(AU8<>\"\",IF(AU8=\"Victoire\",IF(VLOOKUP(AR8,$A$8:$AO$72,47,FALSE)=\"Défaite\",\"OK\",\"ERR\"),IF(AU8=\"Défaite\",IF(VLOOKUP(AR8,$A$8:$AO$72,47,FALSE)=\"Victoire\",\"OK\",\"ERR\"),IF(AU8=\"Nul\",IF(VLOOKUP(AR8,$A$8:$AO$72,47,FALSE)=\"Nul\",\"OK\",\"ERR\")))),\"\")","v":""},null,{"$f":"IF(AU8=\"Victoire\",100-ROUNDDOWN(20*AW8/$H8,0),\nIF(AU8=\"Défaite\",10+ROUNDDOWN(20*VLOOKUP(AR8,$A$8:$BG$72,49,FALSE)/VLOOKUP(AR8,$A$8:$H$72,8,FALSE),0),\nIF(AND(AU8=\"Nul\",$AP8<>$H8),40+(2*ROUNDDOWN(10*VLOOKUP(AR8,$A$8:$BG$72,49,FALSE)/VLOOKUP(AR8,$A$8:$H$72,8,FALSE),0)-ROUNDDOWN(10*AW8/$H8,0)),IF(AND(AU8=\"Nul\",$AP8=$H8),58,0))))","v":0},null,{"$f":"IF($I8<>\"\",VLOOKUP($I8,$A$8:$N$72,5,FALSE),0)+IF($P8<>\"\",VLOOKUP($P8,$A$8:$N$72,5,FALSE),0)+IF($W8<>\"\",VLOOKUP($W8,$A$8:$N$72,5,FALSE),0)+IF($AD8<>\"\",VLOOKUP($AD8,$A$8:$N$72,5,FALSE),0)+IF($AK8<>\"\",VLOOKUP($AK8,$A$8:$N$72,5,FALSE),0)+IF($AR8<>\"\",VLOOKUP($AR8,$A$8:$N$72,5,FALSE),0)","v":0}]
{"$rows_left_out":109}
{"sheet":"Instructions","index":1,"n_rows":26,"n_cols":1,"rows_kept":26,"cut":false,"hidden":false,"merged":[]}
["L'Art de la Guerre"]
["The results excel file"]
[]
["The excel file is used to help to pair up and to record Tournament results for L'Art de la Guerre. "]
["Using this spreadsheet allows the Tournament Organiser to submit the results for automatic inclusion in the global tournament database. This generates ELO rankings for players across the world."]
[]
["Instructions"]
["1 - Enter the tournament’s data: tournament name, theme, date, country where it takes place, number of players and number of rounds (3 to 5). Theses pieces of information will be saved in the database."]
{"$rows_left_out":19}
{"sheet":"Round Draws","index":2,"n_rows":2,"n_cols":2,"rows_kept":2,"cut":false,"hidden":false,"merged":[]}
[]
[null,"Round Draws Round 1"]

{"sheet":"Armies","index":3,"n_rows":283,"n_cols":2,"rows_kept":283,"cut":false,"hidden":false,"merged":[]}
[1,"Sumer and Akkad"]
[2,"Sumerian Successor"]
[3,"Amorite Highlanders"]
[4,"Elamites"]
[5,"Ancient Assyrian & Babylonian"]
[6,"Kassite Babylonian"]
[7,"Assyrian"]
[8,"Neo-Babylonian"]
{"$rows_left_out":276}
{"sheet":"Round 1","index":9,"n_rows":93,"n_cols":13,"rows_kept":93,"cut":false,"hidden":false,"merged":[]}
[]
["Round 1 Draw",null,{"$f":"Results!B3","v":"Warfare"}]
[null,null,{"$f":"Results!B4","v":"Période Ancienne"}]
[null,null,null,null,null,null,null,null,null,null,null,null,"VALID?"]
[null,{"$f":"Results!A8","v":0},{"$f":"Results!C8","v":0},{"$f":"Results!B8","v":0},{"$f":"Results!D8","v":0},{"$f":"Results!G8","v":""},"- vs -",{"$f":"VLOOKUP(B5,Results!$A$8:AG60,9,)","v":{"$error":"#N/A"}},{"$f":"VLOOKUP(H5,Results!A$8:G60,3,FALSE)","v":{"$error":"#N/A"}},{"$f":"VLOOKUP(H5,Results!$A$8:G60,2,FALSE)","v":{"$error":"#N/A"}},{"$f":"VLOOKUP(H5,Results!$A$8:G60,4,FALSE)","v":{"$error":"#N/A"}},{"$f":"VLOOKUP(H5,Results!$A$8:G60,7,FALSE)","v":{"$error":"#N/A"}},{"$f":"VLOOKUP(H5,$B$4:B5,1,FALSE)","v":{"$error":"#N/A"}}]
[null,{"$f":"Results!A9","v":0},{"$f":"Results!C9","v":0},{"$f":"Results!B9","v":0},{"$f":"Results!D9","v":0},{"$f":"Results!G9","v":""},"- vs -",{"$f":"VLOOKUP(B6,Results!$A$8:AG61,9,)","v":{"$error":"#N/A"}},{"$f":"VLOOKUP(H6,Results!A$8:G61,3,)","v":{"$error":"#N/A"}},{"$f":"VLOOKUP(H6,Results!$A$8:G61,2,FALSE)","v":{"$error":"#N/A"}},{"$f":"VLOOKUP(H6,Results!$A$8:G61,4,FALSE)","v":{"$error":"#N/A"}},{"$f":"VLOOKUP(H6,Results!$A$8:G61,7,FALSE)","v":{"$error":"#N/A"}},{"$f":"VLOOKUP(H6,$B$4:B6,1,FALSE)","v":{"$error":"#N/A"}}]
[null,{"$f":"Results!A10","v":0},{"$f":"Results!C10","v":0},{"$f":"Results!B10","v":0},{"$f":"Results!D10","v":0},{"$f":"Results!G10","v":""},"- vs -",{"$f":"VLOOKUP(B7,Results!$A$8:AG62,9,)","v":{"$error":"#N/A"}},{"$f":"VLOOKUP(H7,Results!A$8:G62,3,)","v":{"$error":"#N/A"}},{"$f":"VLOOKUP(H7,Results!$A$8:G62,2,FALSE)","v":{"$error":"#N/A"}},{"$f":"VLOOKUP(H7,Results!$A$8:G62,4,FALSE)","v":{"$error":"#N/A"}},{"$f":"VLOOKUP(H7,Results!$A$8:G62,7,FALSE)","v":{"$error":"#N/A"}},{"$f":"VLOOKUP(H7,$B$4:B7,1,FALSE)","v":{"$error":"#N/A"}}]
[null,{"$f":"Results!A11","v":0},{"$f":"Results!C11","v":0},{"$f":"Results!B11","v":0},{"$f":"Results!D11","v":0},{"$f":"Results!G11","v":""},"- vs -",{"$f":"VLOOKUP(B8,Results!$A$8:AG63,9,)","v":{"$error":"#N/A"}},{"$f":"VLOOKUP(H8,Results!A$8:G63,3,)","v":{"$error":"#N/A"}},{"$f":"VLOOKUP(H8,Results!$A$8:G63,2,FALSE)","v":{"$error":"#N/A"}},{"$f":"VLOOKUP(H8,Results!$A$8:G63,4,FALSE)","v":{"$error":"#N/A"}},{"$f":"VLOOKUP(H8,Results!$A$8:G63,7,FALSE)","v":{"$error":"#N/A"}},{"$f":"VLOOKUP(H8,$B$4:B8,1,FALSE)","v":{"$error":"#N/A"}}]
{"$rows_left_out":86}
{"sheet":"Round 2","index":10,"n_rows":69,"n_cols":13,"rows_kept":69,"cut":false,"hidden":false,"merged":[]}
[]
["Round 2 Draw",null,{"$f":"Results!B3","v":"Warfare"}]
[null,null,{"$f":"Results!B4","v":"Période Ancienne"}]
[null,null,null,null,null,null,null,null,null,null,null,null,"VALID?"]
[null,{"$f":"Results!A8","v":0},{"$f":"Results!C8","v":0},{"$f":"Results!B8","v":0},{"$f":"Results!D8","v":0},{"$f":"Results!G8","v":""},"- vs -",{"$f":"VLOOKUP(B5,Results!$A$8:$AG$60,16,FALSE)","v":{"$error":"#N/A"}},{"$f":"VLOOKUP(H5,Results!A$8:$G$60,3,FALSE)","v":{"$error":"#N/A"}},{"$f":"VLOOKUP(H5,Results!$A$8:$G$60,2,FALSE)","v":{"$error":"#N/A"}},{"$f":"VLOOKUP(H5,Results!$A$8:$G$60,4,FALSE)","v":{"$error":"#N/A"}},{"$f":"VLOOKUP(H5,Results!$A$8:$G$60,7,FALSE)","v":{"$error":"#N/A"}},{"$f":"VLOOKUP(H5,$B$4:B5,1,FALSE)","v":{"$error":"#N/A"}}]
[null,{"$f":"Results!A9","v":0},{"$f":"Results!C9","v":0},{"$f":"Results!B9","v":0},{"$f":"Results!D9","v":0},{"$f":"Results!G9","v":""},"- vs -",{"$f":"VLOOKUP(B6,Results!$A$8:$AG$60,16,FALSE)","v":{"$error":"#N/A"}},{"$f":"VLOOKUP(H6,Results!A$8:$G$60,3,FALSE)","v":{"$error":"#N/A"}},{"$f":"VLOOKUP(H6,Results!$A$8:$G$60,2,FALSE)","v":{"$error":"#N/A"}},{"$f":"VLOOKUP(H6,Results!$A$8:$G$60,4,FALSE)","v":{"$error":"#N/A"}},{"$f":"VLOOKUP(H6,Results!$A$8:$G$60,7,FALSE)","v":{"$error":"#N/A"}},{"$f":"VLOOKUP(H6,$B$4:B6,1,FALSE)","v":{"$error":"#N/A"}}]
[null,{"$f":"Results!A10","v":0},{"$f":"Results!C10","v":0},{"$f":"Results!B10","v":0},{"$f":"Results!D10","v":0},{"$f":"Results!G10","v":""},"- vs -",{"$f":"VLOOKUP(B7,Results!$A$8:$AG$60,16,FALSE)","v":{"$error":"#N/A"}},{"$f":"VLOOKUP(H7,Results!A$8:$G$60,3,FALSE)","v":{"$error":"#N/A"}},{"$f":"VLOOKUP(H7,Results!$A$8:$G$60,2,FALSE)","v":{"$error":"#N/A"}},{"$f":"VLOOKUP(H7,Results!$A$8:$G$60,4,FALSE)","v":{"$error":"#N/A"}},{"$f":"VLOOKUP(H7,Results!$A$8:$G$60,7,FALSE)","v":{"$error":"#N/A"}},{"$f":"VLOOKUP(H7,$B$4:B7,1,FALSE)","v":{"$error":"#N/A"}}]
[null,{"$f":"Results!A11","v":0},{"$f":"Results!C11","v":0},{"$f":"Results!B11","v":0},{"$f":"Results!D11","v":0},{"$f":"Results!G11","v":""},"- vs -",{"$f":"VLOOKUP(B8,Results!$A$8:$AG$60,16,FALSE)","v":{"$error":"#N/A"}},{"$f":"VLOOKUP(H8,Results!A$8:$G$60,3,FALSE)","v":{"$error":"#N/A"}},{"$f":"VLOOKUP(H8,Results!$A$8:$G$60,2,FALSE)","v":{"$error":"#N/A"}},{"$f":"VLOOKUP(H8,Results!$A$8:$G$60,4,FALSE)","v":{"$error":"#N/A"}},{"$f":"VLOOKUP(H8,Results!$A$8:$G$60,7,FALSE)","v":{"$error":"#N/A"}},{"$f":"VLOOKUP(H8,$B$4:B8,1,FALSE)","v":{"$error":"#N/A"}}]
{"$rows_left_out":62}
{"sheet":"Round 3","index":11,"n_rows":69,"n_cols":13,"rows_kept":69,"cut":false,"hidden":false,"merged":[]}
[]
["Round 3 Draw",null,null,{"$f":"Results!B3","v":"Warfare"}]
[null,null,null,{"$f":"Results!B4","v":"Période Ancienne"}]
[null,null,null,null,null,null,null,null,null,null,null,null,"VALID?"]
[null,{"$f":"Results!A8","v":0},{"$f":"Results!C8","v":0},{"$f":"Results!B8","v":0},{"$f":"Results!D8","v":0},{"$f":"Results!G8","v":""},"- vs -",{"$f":"VLOOKUP(B5,Results!$A$8:$AG$60,23,FALSE)","v":{"$error":"#N/A"}},{"$f":"VLOOKUP(H5,Results!A$8:$G$60,3,FALSE)","v":{"$error":"#N/A"}},{"$f":"VLOOKUP(H5,Results!$A$8:$G$60,2,FALSE)","v":{"$error":"#N/A"}},{"$f":"VLOOKUP(H5,Results!$A$8:$G$60,4,FALSE)","v":{"$error":"#N/A"}},{"$f":"VLOOKUP(H5,Results!$A$8:$G$60,7,FALSE)","v":{"$error":"#N/A"}},{"$f":"VLOOKUP(H5,$B$4:B5,1,FALSE)","v":{"$error":"#N/A"}}]
[null,{"$f":"Results!A9","v":0},{"$f":"Results!C9","v":0},{"$f":"Results!B9","v":0},{"$f":"Results!D9","v":0},{"$f":"Results!G9","v":""},"- vs -",{"$f":"VLOOKUP(B6,Results!$A$8:$AG$60,23,FALSE)","v":{"$error":"#N/A"}},{"$f":"VLOOKUP(H6,Results!A$8:$G$60,3,FALSE)","v":{"$error":"#N/A"}},{"$f":"VLOOKUP(H6,Results!$A$8:$G$60,2,FALSE)","v":{"$error":"#N/A"}},{"$f":"VLOOKUP(H6,Results!$A$8:$G$60,4,FALSE)","v":{"$error":"#N/A"}},{"$f":"VLOOKUP(H6,Results!$A$8:$G$60,7,FALSE)","v":{"$error":"#N/A"}},{"$f":"VLOOKUP(H6,$B$4:B6,1,FALSE)","v":{"$error":"#N/A"}}]
[null,{"$f":"Results!A10","v":0},{"$f":"Results!C10","v":0},{"$f":"Results!B10","v":0},{"$f":"Results!D10","v":0},{"$f":"Results!G10","v":""},"- vs -",{"$f":"VLOOKUP(B7,Results!$A$8:$AG$60,23,FALSE)","v":{"$error":"#N/A"}},{"$f":"VLOOKUP(H7,Results!A$8:$G$60,3,FALSE)","v":{"$error":"#N/A"}},{"$f":"VLOOKUP(H7,Results!$A$8:$G$60,2,FALSE)","v":{"$error":"#N/A"}},{"$f":"VLOOKUP(H7,Results!$A$8:$G$60,4,FALSE)","v":{"$error":"#N/A"}},{"$f":"VLOOKUP(H7,Results!$A$8:$G$60,7,FALSE)","v":{"$error":"#N/A"}},{"$f":"VLOOKUP(H7,$B$4:B7,1,FALSE)","v":{"$error":"#N/A"}}]
[null,{"$f":"Results!A11","v":0},{"$f":"Results!C11","v":0},{"$f":"Results!B11","v":0},{"$f":"Results!D11","v":0},{"$f":"Results!G11","v":""},"- vs -",{"$f":"VLOOKUP(B8,Results!$A$8:$AG$60,23,FALSE)","v":{"$error":"#N/A"}},{"$f":"VLOOKUP(H8,Results!A$8:$G$60,3,FALSE)","v":{"$error":"#N/A"}},{"$f":"VLOOKUP(H8,Results!$A$8:$G$60,2,FALSE)","v":{"$error":"#N/A"}},{"$f":"VLOOKUP(H8,Results!$A$8:$G$60,4,FALSE)","v":{"$error":"#N/A"}},{"$f":"VLOOKUP(H8,Results!$A$8:$G$60,7,FALSE)","v":{"$error":"#N/A"}},{"$f":"VLOOKUP(H8,$B$4:B8,1,FALSE)","v":{"$error":"#N/A"}}]
{"$rows_left_out":62}
{"sheet":"Round 4","index":12,"n_rows":69,"n_cols":13,"rows_kept":69,"cut":false,"hidden":false,"merged":[]}
[]
[null,null,{"$f":"Results!B3","v":"Warfare"},null,"Round 4 Draw"]
[null,null,{"$f":"Results!B4","v":"Période Ancienne"}]
[null,null,null,null,null,null,null,null,null,null,null,null,"VALID?"]
[null,{"$f":"Results!A8","v":0},{"$f":"Results!C8","v":0},{"$f":"Results!B8","v":0},{"$f":"Results!D8","v":0},{"$f":"Results!G8","v":""},"- vs -",{"$f":"VLOOKUP(B5,Results!$A$8:$AG$60,30,FALSE)","v":{"$error":"#N/A"}},{"$f":"VLOOKUP(H5,Results!A$8:$G$60,3,FALSE)","v":{"$error":"#N/A"}},{"$f":"VLOOKUP(H5,Results!$A$8:$G$60,2,FALSE)","v":{"$error":"#N/A"}},{"$f":"VLOOKUP(H5,Results!$A$8:$G$60,4,FALSE)","v":{"$error":"#N/A"}},{"$f":"VLOOKUP(H5,Results!$A$8:$G$60,7,FALSE)","v":{"$error":"#N/A"}},{"$f":"VLOOKUP(H5,$B$4:B5,1,FALSE)","v":{"$error":"#N/A"}}]
[null,{"$f":"Results!A9","v":0},{"$f":"Results!C9","v":0},{"$f":"Results!B9","v":0},{"$f":"Results!D9","v":0},{"$f":"Results!G9","v":""},"- vs -",{"$f":"VLOOKUP(B6,Results!$A$8:$AG$60,30,FALSE)","v":{"$error":"#N/A"}},{"$f":"VLOOKUP(H6,Results!A$8:$G$60,3,FALSE)","v":{"$error":"#N/A"}},{"$f":"VLOOKUP(H6,Results!$A$8:$G$60,2,FALSE)","v":{"$error":"#N/A"}},{"$f":"VLOOKUP(H6,Results!$A$8:$G$60,4,FALSE)","v":{"$error":"#N/A"}},{"$f":"VLOOKUP(H6,Results!$A$8:$G$60,7,FALSE)","v":{"$error":"#N/A"}},{"$f":"VLOOKUP(H6,$B$4:B6,1,FALSE)","v":{"$error":"#N/A"}}]
[null,{"$f":"Results!A10","v":0},{"$f":"Results!C10","v":0},{"$f":"Results!B10","v":0},{"$f":"Results!D10","v":0},{"$f":"Results!G10","v":""},"- vs -",{"$f":"VLOOKUP(B7,Results!$A$8:$AG$60,30,FALSE)","v":{"$error":"#N/A"}},{"$f":"VLOOKUP(H7,Results!A$8:$G$60,3,FALSE)","v":{"$error":"#N/A"}},{"$f":"VLOOKUP(H7,Results!$A$8:$G$60,2,FALSE)","v":{"$error":"#N/A"}},{"$f":"VLOOKUP(H7,Results!$A$8:$G$60,4,FALSE)","v":{"$error":"#N/A"}},{"$f":"VLOOKUP(H7,Results!$A$8:$G$60,7,FALSE)","v":{"$error":"#N/A"}},{"$f":"VLOOKUP(H7,$B$4:B7,1,FALSE)","v":{"$error":"#N/A"}}]
[null,{"$f":"Results!A11","v":0},{"$f":"Results!C11","v":0},{"$f":"Results!B11","v":0},{"$f":"Results!D11","v":0},{"$f":"Results!G11","v":""},"- vs -",{"$f":"VLOOKUP(B8,Results!$A$8:$AG$60,30,FALSE)","v":{"$error":"#N/A"}},{"$f":"VLOOKUP(H8,Results!A$8:$G$60,3,FALSE)","v":{"$error":"#N/A"}},{"$f":"VLOOKUP(H8,Results!$A$8:$G$60,2,FALSE)","v":{"$error":"#N/A"}},{"$f":"VLOOKUP(H8,Results!$A$8:$G$60,4,FALSE)","v":{"$error":"#N/A"}},{"$f":"VLOOKUP(H8,Results!$A$8:$G$60,7,FALSE)","v":{"$error":"#N/A"}},{"$f":"VLOOKUP(H8,$B$4:B8,1,FALSE)","v":{"$error":"#N/A"}}]
{"$rows_left_out":62}
{"sheet":"Round 5","index":13,"n_rows":69,"n_cols":13,"rows_kept":69,"cut":false,"hidden":false,"merged":[]}
[null,null,null,null,"Round 5 Draw"]
[null,null,{"$f":"Results!B3","v":"Warfare"}]
[null,null,{"$f":"Results!B4","v":"Période Ancienne"}]
[null,null,null,null,null,null,null,null,null,null,null,null,"VALID?"]
[null,{"$f":"Results!A8","v":0},{"$f":"Results!C8","v":0},{"$f":"Results!B8","v":0},{"$f":"Results!D8","v":0},{"$f":"Results!G8","v":""},"- vs -",{"$f":"VLOOKUP(B5,Results!$A$8:AK59,37,FALSE)","v":{"$error":"#N/A"}},{"$f":"VLOOKUP(H5,Results!A$8:G60,3,FALSE)","v":{"$error":"#N/A"}},{"$f":"VLOOKUP(H5,Results!$A$8:G60,2,FALSE)","v":{"$error":"#N/A"}},{"$f":"VLOOKUP(H5,Results!$A$8:G60,4,FALSE)","v":{"$error":"#N/A"}},{"$f":"VLOOKUP(H5,Results!$A$8:G60,7,FALSE)","v":{"$error":"#N/A"}},{"$f":"VLOOKUP(H5,$B$4:B5,1,FALSE)","v":{"$error":"#N/A"}}]
[null,{"$f":"Results!A9","v":0},{"$f":"Results!C9","v":0},{"$f":"Results!B9","v":0},{"$f":"Results!D9","v":0},{"$f":"Results!G9","v":""},"- vs -",{"$f":"VLOOKUP(B6,Results!$A$8:AK60,37,FALSE)","v":{"$error":"#N/A"}},{"$f":"VLOOKUP(H6,Results!A$8:G61,3,FALSE)","v":{"$error":"#N/A"}},{"$f":"VLOOKUP(H6,Results!$A$8:G61,2,FALSE)","v":{"$error":"#N/A"}},{"$f":"VLOOKUP(H6,Results!$A$8:G61,4,FALSE)","v":{"$error":"#N/A"}},{"$f":"VLOOKUP(H6,Results!$A$8:G61,7,FALSE)","v":{"$error":"#N/A"}},{"$f":"VLOOKUP(H6,$B$4:B6,1,FALSE)","v":{"$error":"#N/A"}}]
[null,{"$f":"Results!A10","v":0},{"$f":"Results!C10","v":0},{"$f":"Results!B10","v":0},{"$f":"Results!D10","v":0},{"$f":"Results!G10","v":""},"- vs -",{"$f":"VLOOKUP(B7,Results!$A$8:AK61,37,FALSE)","v":{"$error":"#N/A"}},{"$f":"VLOOKUP(H7,Results!A$8:G62,3,FALSE)","v":{"$error":"#N/A"}},{"$f":"VLOOKUP(H7,Results!$A$8:G62,2,FALSE)","v":{"$error":"#N/A"}},{"$f":"VLOOKUP(H7,Results!$A$8:G62,4,FALSE)","v":{"$error":"#N/A"}},{"$f":"VLOOKUP(H7,Results!$A$8:G62,7,FALSE)","v":{"$error":"#N/A"}},{"$f":"VLOOKUP(H7,$B$4:B7,1,FALSE)","v":{"$error":"#N/A"}}]
[null,{"$f":"Results!A11","v":0},{"$f":"Results!C11","v":0},{"$f":"Results!B11","v":0},{"$f":"Results!D11","v":0},{"$f":"Results!G11","v":""},"- vs -",{"$f":"VLOOKUP(B8,Results!$A$8:AK62,37,FALSE)","v":{"$error":"#N/A"}},{"$f":"VLOOKUP(H8,Results!A$8:G63,3,FALSE)","v":{"$error":"#N/A"}},{"$f":"VLOOKUP(H8,Results!$A$8:G63,2,FALSE)","v":{"$error":"#N/A"}},{"$f":"VLOOKUP(H8,Results!$A$8:G63,4,FALSE)","v":{"$error":"#N/A"}},{"$f":"VLOOKUP(H8,Results!$A$8:G63,7,FALSE)","v":{"$error":"#N/A"}},{"$f":"VLOOKUP(H8,$B$4:B8,1,FALSE)","v":{"$error":"#N/A"}}]
{"$rows_left_out":62}
{"sheet":"Round 6","index":14,"n_rows":69,"n_cols":13,"rows_kept":69,"cut":false,"hidden":false,"merged":[]}
[]
["Round 6 Draw",null,{"$f":"Results!B3","v":"Warfare"}]
[null,null,{"$f":"Results!B4","v":"Période Ancienne"}]
[null,null,null,null,null,null,null,null,null,null,null,null,"VALID?"]
[null,{"$f":"Results!A8","v":0},{"$f":"Results!C8","v":0},{"$f":"Results!B8","v":0},{"$f":"Results!D8","v":0},{"$f":"Results!G8","v":""},"- vs -",{"$f":"VLOOKUP(B5,Results!$A$8:AR59,44,FALSE)","v":{"$error":"#N/A"}},{"$f":"VLOOKUP(H5,Results!A$8:G60,3,FALSE)","v":{"$error":"#N/A"}},{"$f":"VLOOKUP(H5,Results!$A$8:G60,2,FALSE)","v":{"$error":"#N/A"}},{"$f":"VLOOKUP(H5,Results!$A$8:G60,4,FALSE)","v":{"$error":"#N/A"}},{"$f":"VLOOKUP(H5,Results!$A$8:G60,7,FALSE)","v":{"$error":"#N/A"}},{"$f":"VLOOKUP(H5,$B$4:B5,1,FALSE)","v":{"$error":"#N/A"}}]
[null,{"$f":"Results!A9","v":0},{"$f":"Results!C9","v":0},{"$f":"Results!B9","v":0},{"$f":"Results!D9","v":0},{"$f":"Results!G9","v":""},"- vs -",{"$f":"VLOOKUP(B6,Results!$A$8:AR60,44,FALSE)","v":{"$error":"#N/A"}},{"$f":"VLOOKUP(H6,Results!A$8:G61,3,FALSE)","v":{"$error":"#N/A"}},{"$f":"VLOOKUP(H6,Results!$A$8:G61,2,FALSE)","v":{"$error":"#N/A"}},{"$f":"VLOOKUP(H6,Results!$A$8:G61,4,FALSE)","v":{"$error":"#N/A"}},{"$f":"VLOOKUP(H6,Results!$A$8:G61,7,FALSE)","v":{"$error":"#N/A"}},{"$f":"VLOOKUP(H6,$B$4:B6,1,FALSE)","v":{"$error":"#N/A"}}]
[null,{"$f":"Results!A10","v":0},{"$f":"Results!C10","v":0},{"$f":"Results!B10","v":0},{"$f":"Results!D10","v":0},{"$f":"Results!G10","v":""},"- vs -",{"$f":"VLOOKUP(B7,Results!$A$8:AR61,44,FALSE)","v":{"$error":"#N/A"}},{"$f":"VLOOKUP(H7,Results!A$8:G62,3,FALSE)","v":{"$error":"#N/A"}},{"$f":"VLOOKUP(H7,Results!$A$8:G62,2,FALSE)","v":{"$error":"#N/A"}},{"$f":"VLOOKUP(H7,Results!$A$8:G62,4,FALSE)","v":{"$error":"#N/A"}},{"$f":"VLOOKUP(H7,Results!$A$8:G62,7,FALSE)","v":{"$error":"#N/A"}},{"$f":"VLOOKUP(H7,$B$4:B7,1,FALSE)","v":{"$error":"#N/A"}}]
[null,{"$f":"Results!A11","v":0},{"$f":"Results!C11","v":0},{"$f":"Results!B11","v":0},{"$f":"Results!D11","v":0},{"$f":"Results!G11","v":""},"- vs -",{"$f":"VLOOKUP(B8,Results!$A$8:AR62,44,FALSE)","v":{"$error":"#N/A"}},{"$f":"VLOOKUP(H8,Results!A$8:G63,3,FALSE)","v":{"$error":"#N/A"}},{"$f":"VLOOKUP(H8,Results!$A$8:G63,2,FALSE)","v":{"$error":"#N/A"}},{"$f":"VLOOKUP(H8,Results!$A$8:G63,4,FALSE)","v":{"$error":"#N/A"}},{"$f":"VLOOKUP(H8,Results!$A$8:G63,7,FALSE)","v":{"$error":"#N/A"}},{"$f":"VLOOKUP(H8,$B$4:B8,1,FALSE)","v":{"$error":"#N/A"}}]
{"$rows_left_out":61}