{"text_format":"1","workbook":"xlsx","n_sheets":18,"sheets":["Results","Instructions","Round Draws","Armees","Module1","Module2","Module3","Module4","Module5","Round 1","Round 2","Round 3","Round 4","Round 5","Round 6","Round 7","Round 8","Standings"],"not_rendered":{"charts":0,"images":9,"macros":1,"external_links":0,"defined_names":9,"comments":0,"pivot_tables":0},"unopened":[{"sheet":"Module1","index":4,"reason":"part_missing"},{"sheet":"Module2","index":5,"reason":"part_missing"},{"sheet":"Module3","index":6,"reason":"part_missing"},{"sheet":"Module4","index":7,"reason":"part_missing"},{"sheet":"Module5","index":8,"reason":"part_missing"}],"bounds":{"document_bytes":16777216,"sheet_cells":100000,"rows_first":2000,"rows_last":500,"rows_between":2000,"halvings":0,"cell_chars":16384,"cell_head_chars":4096},"cells_cut":0,"cells_raw":0,"read":"whole","date_system":"1900"}

{"sheet":"Results","index":0,"n_rows":116,"n_cols":68,"rows_kept":116,"cut":false,"hidden":false,"merged":[[1,65,1,67],[2,4,2,5],[3,4,3,5],[2,1,2,2],[3,1,3,2]]}
["V2.1.1",null,null,"L'Art de la Guerre - Result Sheet"]
[null,null,null,null,null,null,null,null,null,null,null,null,null,null,null,null,null,null,null,null,null,null,null,null,null,null,null,null,null,null,null,null,null,null,null,null,null,null,null,null,null,null,null,null,null,null,null,null,null,null,null,null,null,null,null,null,null,null,null,null,null,null,null,null,null,"Umpire Zone"]
["Tournament",null,null,"Date",null,null,"# Players (8 - 52)"]
["Theme","Open Theme",null,"Country","UK",null,"# Rounds (3 - 8)"]
[]
[null,null,null,null,null,null,null,null,null,null,null,"Rnd 1",null,null,null,null,null,null,"Rnd 2",null,null,null,null,null,null,"Rnd 3",null,null,null,null,null,null,"Rnd 4",null,null,null,null,null,null,"Rnd 5",null,null,null,null,null,null,"Rnd 6",null,null,null,null,null,null,"Rnd 7",null,null,null,null,null,null,"Rnd 8",null,null,null,null,"Opponents","Ex-Aequo","Ajustment"]
{"$rows_left_out":111}
{"sheet":"Instructions","index":1,"n_rows":26,"n_cols":1,"rows_kept":26,"cut":false,"hidden":false,"merged":[]}
["L'Art de la Guerre"]
["The results excel file"]
[]
["The excel file is used to help to pair up and to record Tournament results for L'Art de la Guerre. "]
["Using this spreadsheet allows the Tournament Organiser to submit the results for automatic inclusion in the global tournament database. This generates ELO rankings for players across the world."]
[]
{"$rows_left_out":21}
{"sheet":"Round Draws","index":2,"n_rows":2,"n_cols":2,"rows_kept":2,"cut":false,"hidden":true,"merged":[]}
[]
[null,"Appariements du tour 4"]

{"sheet":"Armees","index":3,"n_rows":283,"n_cols":2,"rows_kept":283,"cut":false,"hidden":true,"merged":[]}
[1,"Sumer and Akkad"]
[2,"Sumerian Successor"]
[3,"Amorrite Highlanders"]
[4,"Elamites"]
[5,"Ancient Assyrian & Babylonian"]
[6,"Kassite Babylonian"]
{"$rows_left_out":278}
{"sheet":"Round 1","index":9,"n_rows":75,"n_cols":13,"rows_kept":75,"cut":false,"hidden":false,"merged":[]}
[]
["Round 1 Draw",null,{"$f":"Results!B3","v":0}]
[null,null,{"$f":"Results!B4","v":"Open Theme"}]
[null,null,null,null,null,null,null,null,null,null,null,null,"VALID?"]
[null,{"$f":"Results!A8","v":0},{"$f":"Results!C8","v":0},{"$f":"Results!B8","v":0},{"$f":"Results!D8","v":0},{"$f":"Results!G8","v":""},"- vs -",{"$f":"VLOOKUP(B5,Results!$A$8:AG60,9,)","v":{"$error":"#N/A"}},{"$f":"VLOOKUP(H5,Results!A$8:G60,3,FALSE)","v":{"$error":"#N/A"}},{"$f":"VLOOKUP(H5,Results!$A$8:G60,2,FALSE)","v":{"$error":"#N/A"}},{"$f":"VLOOKUP(H5,Results!$A$8:G60,4,FALSE)","v":{"$error":"#N/A"}},{"$f":"VLOOKUP(H5,Results!$A$8:G60,7,FALSE)","v":{"$error":"#N/A"}},{"$f":"VLOOKUP(H5,$B$4:B5,1,FALSE)","v":{"$error":"#N/A"}}]
[null,{"$f":"Results!A9","v":0},{"$f":"Results!C9","v":0},{"$f":"Results!B9","v":0},{"$f":"Results!D9","v":0},{"$f":"Results!G9","v":""},"- vs -",{"$f":"VLOOKUP(B6,Results!$A$8:AG61,9,)","v":{"$error":"#N/A"}},{"$f":"VLOOKUP(H6,Results!A$8:G61,3,)","v":{"$error":"#N/A"}},{"$f":"VLOOKUP(H6,Results!$A$8:G61,2,FALSE)","v":{"$error":"#N/A"}},{"$f":"VLOOKUP(H6,Results!$A$8:G61,4,FALSE)","v":{"$error":"#N/A"}},{"$f":"VLOOKUP(H6,Results!$A$8:G61,7,FALSE)","v":{"$error":"#N/A"}},{"$f":"VLOOKUP(H6,$B$4:B6,1,FALSE)","v":{"$error":"#N/A"}}]
{"$rows_left_out":70}
{"sheet":"Round 2","index":10,"n_rows":75,"n_cols":13,"rows_kept":75,"cut":false,"hidden":false,"merged":[]}
[]
["Round 2 Draw",null,{"$f":"Results!B3","v":0}]
[null,null,{"$f":"Results!B4","v":"Open Theme"}]
[null,null,null,null,null,null,null,null,null,null,null,null,"VALID?"]
[null,{"$f":"Results!A8","v":0},{"$f":"Results!C8","v":0},{"$f":"Results!B8","v":0},{"$f":"Results!D8","v":0},{"$f":"Results!G8","v":""},"- vs -",{"$f":"VLOOKUP(B5,Results!$A$8:$AG$60,16,FALSE)","v":{"$error":"#N/A"}},{"$f":"VLOOKUP(H5,Results!A$8:$G$60,3,FALSE)","v":{"$error":"#N/A"}},{"$f":"VLOOKUP(H5,Results!$A$8:$G$60,2,FALSE)","v":{"$error":"#N/A"}},{"$f":"VLOOKUP(H5,Results!$A$8:$G$60,4,FALSE)","v":{"$error":"#N/A"}},{"$f":"VLOOKUP(H5,Results!$A$8:$G$60,7,FALSE)","v":{"$error":"#N/A"}},{"$f":"VLOOKUP(H5,$B$4:B5,1,FALSE)","v":{"$error":"#N/A"}}]
[null,{"$f":"Results!A9","v":0},{"$f":"Results!C9","v":0},{"$f":"Results!B9","v":0},{"$f":"Results!D9","v":0},{"$f":"Results!G9","v":""},"- vs -",{"$f":"VLOOKUP(B6,Results!$A$8:$AG$60,16,FALSE)","v":{"$error":"#N/A"}},{"$f":"VLOOKUP(H6,Results!A$8:$G$60,3,FALSE)","v":{"$error":"#N/A"}},{"$f":"VLOOKUP(H6,Results!$A$8:$G$60,2,FALSE)","v":{"$error":"#N/A"}},{"$f":"VLOOKUP(H6,Results!$A$8:$G$60,4,FALSE)","v":{"$error":"#N/A"}},{"$f":"VLOOKUP(H6,Results!$A$8:$G$60,7,FALSE)","v":{"$error":"#N/A"}},{"$f":"VLOOKUP(H6,$B$4:B6,1,FALSE)","v":{"$error":"#N/A"}}]
{"$rows_left_out":70}
{"sheet":"Round 3","index":11,"n_rows":75,"n_cols":13,"rows_kept":75,"cut":false,"hidden":false,"merged":[]}
[]
["Round 3 Draw",null,{"$f":"Results!B3","v":0}]
[null,null,{"$f":"Results!B4","v":"Open Theme"}]
[null,null,null,null,null,null,null,null,null,null,null,null,"VALID?"]
[null,{"$f":"Results!A8","v":0},{"$f":"Results!C8","v":0},{"$f":"Results!B8","v":0},{"$f":"Results!D8","v":0},{"$f":"Results!G8","v":""},"- vs -",{"$f":"VLOOKUP(B5,Results!$A$8:$AG$60,23,FALSE)","v":{"$error":"#N/A"}},{"$f":"VLOOKUP(H5,Results!A$8:$G$60,3,FALSE)","v":{"$error":"#N/A"}},{"$f":"VLOOKUP(H5,Results!$A$8:$G$60,2,FALSE)","v":{"$error":"#N/A"}},{"$f":"VLOOKUP(H5,Results!$A$8:$G$60,4,FALSE)","v":{"$error":"#N/A"}},{"$f":"VLOOKUP(H5,Results!$A$8:$G$60,7,FALSE)","v":{"$error":"#N/A"}},{"$f":"VLOOKUP(H5,$B$4:B5,1,FALSE)","v":{"$error":"#N/A"}}]
[null,{"$f":"Results!A9","v":0},{"$f":"Results!C9","v":0},{"$f":"Results!B9","v":0},{"$f":"Results!D9","v":0},{"$f":"Results!G9","v":""},"- vs -",{"$f":"VLOOKUP(B6,Results!$A$8:$AG$60,23,FALSE)","v":{"$error":"#N/A"}},{"$f":"VLOOKUP(H6,Results!A$8:$G$60,3,FALSE)","v":{"$error":"#N/A"}},{"$f":"VLOOKUP(H6,Results!$A$8:$G$60,2,FALSE)","v":{"$error":"#N/A"}},{"$f":"VLOOKUP(H6,Results!$A$8:$G$60,4,FALSE)","v":{"$error":"#N/A"}},{"$f":"VLOOKUP(H6,Results!$A$8:$G$60,7,FALSE)","v":{"$error":"#N/A"}},{"$f":"VLOOKUP(H6,$B$4:B6,1,FALSE)","v":{"$error":"#N/A"}}]
{"$rows_left_out":70}
{"sheet":"Round 4","index":12,"n_rows":63,"n_cols":13,"rows_kept":63,"cut":false,"hidden":false,"merged":[]}
[]
["Round 4 Draw",null,{"$f":"Results!B3","v":0}]
[null,null,{"$f":"Results!B4","v":"Open Theme"}]
[null,null,null,null,null,null,null,null,null,null,null,null,"VALID?"]
[null,{"$f":"Results!A8","v":0},{"$f":"Results!C8","v":0},{"$f":"Results!B8","v":0},{"$f":"Results!D8","v":0},{"$f":"Results!G8","v":""},"- vs -",{"$f":"VLOOKUP(B5,Results!$A$8:$AG$60,30,FALSE)","v":{"$error":"#N/A"}},{"$f":"VLOOKUP(H5,Results!A$8:$G$60,3,FALSE)","v":{"$error":"#N/A"}},{"$f":"VLOOKUP(H5,Results!$A$8:$G$60,2,FALSE)","v":{"$error":"#N/A"}},{"$f":"VLOOKUP(H5,Results!$A$8:$G$60,4,FALSE)","v":{"$error":"#N/A"}},{"$f":"VLOOKUP(H5,Results!$A$8:$G$60,7,FALSE)","v":{"$error":"#N/A"}},{"$f":"VLOOKUP(H5,$B$4:B5,1,FALSE)","v":{"$error":"#N/A"}}]
[null,{"$f":"Results!A9","v":0},{"$f":"Results!C9","v":0},{"$f":"Results!B9","v":0},{"$f":"Results!D9","v":0},{"$f":"Results!G9","v":""},"- vs -",{"$f":"VLOOKUP(B6,Results!$A$8:$AG$60,30,FALSE)","v":{"$error":"#N/A"}},{"$f":"VLOOKUP(H6,Results!A$8:$G$60,3,FALSE)","v":{"$error":"#N/A"}},{"$f":"VLOOKUP(H6,Results!$A$8:$G$60,2,FALSE)","v":{"$error":"#N/A"}},{"$f":"VLOOKUP(H6,Results!$A$8:$G$60,4,FALSE)","v":{"$error":"#N/A"}},{"$f":"VLOOKUP(H6,Results!$A$8:$G$60,7,FALSE)","v":{"$error":"#N/A"}},{"$f":"VLOOKUP(H6,$B$4:B6,1,FALSE)","v":{"$error":"#N/A"}}]
{"$rows_left_out":58}
{"sheet":"Round 5","index":13,"n_rows":63,"n_cols":13,"rows_kept":63,"cut":false,"hidden":false,"merged":[]}
[]
["Round 5 Draw",null,{"$f":"Results!B3","v":0}]
[null,null,{"$f":"Results!B4","v":"Open Theme"}]
[null,null,null,null,null,null,null,null,null,null,null,null,"VALID?"]
[null,{"$f":"Results!A8","v":0},{"$f":"Results!C8","v":0},{"$f":"Results!B8","v":0},{"$f":"Results!D8","v":0},{"$f":"Results!G8","v":""},"- vs -",{"$f":"VLOOKUP(B5,Results!$A$8:AK59,37,FALSE)","v":{"$error":"#N/A"}},{"$f":"VLOOKUP(H5,Results!A$8:G60,3,FALSE)","v":{"$error":"#N/A"}},{"$f":"VLOOKUP(H5,Results!$A$8:G60,2,FALSE)","v":{"$error":"#N/A"}},{"$f":"VLOOKUP(H5,Results!$A$8:G60,4,FALSE)","v":{"$error":"#N/A"}},{"$f":"VLOOKUP(H5,Results!$A$8:G60,7,FALSE)","v":{"$error":"#N/A"}},{"$f":"VLOOKUP(H5,$B$4:B5,1,FALSE)","v":{"$error":"#N/A"}}]
[null,{"$f":"Results!A9","v":0},{"$f":"Results!C9","v":0},{"$f":"Results!B9","v":0},{"$f":"Results!D9","v":0},{"$f":"Results!G9","v":""},"- vs -",{"$f":"VLOOKUP(B6,Results!$A$8:AK60,37,FALSE)","v":{"$error":"#N/A"}},{"$f":"VLOOKUP(H6,Results!A$8:G61,3,FALSE)","v":{"$error":"#N/A"}},{"$f":"VLOOKUP(H6,Results!$A$8:G61,2,FALSE)","v":{"$error":"#N/A"}},{"$f":"VLOOKUP(H6,Results!$A$8:G61,4,FALSE)","v":{"$error":"#N/A"}},{"$f":"VLOOKUP(H6,Results!$A$8:G61,7,FALSE)","v":{"$error":"#N/A"}},{"$f":"VLOOKUP(H6,$B$4:B6,1,FALSE)","v":{"$error":"#N/A"}}]
{"$rows_left_out":58}
{"sheet":"Round 6","index":14,"n_rows":63,"n_cols":13,"rows_kept":63,"cut":false,"hidden":false,"merged":[]}
[]
["Round 5 Draw",null,{"$f":"Results!B3","v":0}]
[null,null,{"$f":"Results!B4","v":"Open Theme"}]
[null,null,null,null,null,null,null,null,null,null,null,null,"VALID?"]
[null,{"$f":"Results!A8","v":0},{"$f":"Results!C8","v":0},{"$f":"Results!B8","v":0},{"$f":"Results!D8","v":0},{"$f":"Results!G8","v":""},"- vs -",{"$f":"VLOOKUP(B5,Results!$A$8:AR59,44,FALSE)","v":{"$error":"#N/A"}},{"$f":"VLOOKUP(H5,Results!A$8:G60,3,FALSE)","v":{"$error":"#N/A"}},{"$f":"VLOOKUP(H5,Results!$A$8:G60,2,FALSE)","v":{"$error":"#N/A"}},{"$f":"VLOOKUP(H5,Results!$A$8:G60,4,FALSE)","v":{"$error":"#N/A"}},{"$f":"VLOOKUP(H5,Results!$A$8:G60,7,FALSE)","v":{"$error":"#N/A"}},{"$f":"VLOOKUP(H5,$B$4:B5,1,FALSE)","v":{"$error":"#N/A"}}]
[null,{"$f":"Results!A9","v":0},{"$f":"Results!C9","v":0},{"$f":"Results!B9","v":0},{"$f":"Results!D9","v":0},{"$f":"Results!G9","v":""},"- vs -",{"$f":"VLOOKUP(B6,Results!$A$8:AR60,44,FALSE)","v":{"$error":"#N/A"}},{"$f":"VLOOKUP(H6,Results!A$8:G61,3,FALSE)","v":{"$error":"#N/A"}},{"$f":"VLOOKUP(H6,Results!$A$8:G61,2,FALSE)","v":{"$error":"#N/A"}},{"$f":"VLOOKUP(H6,Results!$A$8:G61,4,FALSE)","v":{"$error":"#N/A"}},{"$f":"VLOOKUP(H6,Results!$A$8:G61,7,FALSE)","v":{"$error":"#N/A"}},{"$f":"VLOOKUP(H6,$B$4:B6,1,FALSE)","v":{"$error":"#N/A"}}]
{"$rows_left_out":58}
{"sheet":"Round 7","index":15,"n_rows":63,"n_cols":13,"rows_kept":63,"cut":false,"hidden":false,"merged":[]}
[]
["Round 5 Draw",null,{"$f":"Results!B3","v":0}]
[null,null,{"$f":"Results!B4","v":"Open Theme"}]
[null,null,null,null,null,null,null,null,null,null,null,null,"VALID?"]
[null,{"$f":"Results!A8","v":0},{"$f":"Results!C8","v":0},{"$f":"Results!B8","v":0},{"$f":"Results!D8","v":0},{"$f":"Results!G8","v":""},"- vs -",{"$f":"VLOOKUP(B5,Results!$A$8:AY59,51,FALSE)","v":{"$error":"#N/A"}},{"$f":"VLOOKUP(H5,Results!A$8:G60,3,FALSE)","v":{"$error":"#N/A"}},{"$f":"VLOOKUP(H5,Results!$A$8:G60,2,FALSE)","v":{"$error":"#N/A"}},{"$f":"VLOOKUP(H5,Results!$A$8:G60,4,FALSE)","v":{"$error":"#N/A"}},{"$f":"VLOOKUP(H5,Results!$A$8:G60,7,FALSE)","v":{"$error":"#N/A"}},{"$f":"VLOOKUP(H5,$B$4:B5,1,FALSE)","v":{"$error":"#N/A"}}]
[null,{"$f":"Results!A9","v":0},{"$f":"Results!C9","v":0},{"$f":"Results!B9","v":0},{"$f":"Results!D9","v":0},{"$f":"Results!G9","v":""},"- vs -",{"$f":"VLOOKUP(B6,Results!$A$8:AY60,51,FALSE)","v":{"$error":"#N/A"}},{"$f":"VLOOKUP(H6,Results!A$8:G61,3,FALSE)","v":{"$error":"#N/A"}},{"$f":"VLOOKUP(H6,Results!$A$8:G61,2,FALSE)","v":{"$error":"#N/A"}},{"$f":"VLOOKUP(H6,Results!$A$8:G61,4,FALSE)","v":{"$error":"#N/A"}},{"$f":"VLOOKUP(H6,Results!$A$8:G61,7,FALSE)","v":{"$error":"#N/A"}},{"$f":"VLOOKUP(H6,$B$4:B6,1,FALSE)","v":{"$error":"#N/A"}}]
{"$rows_left_out":58}
{"sheet":"Round 8","index":16,"n_rows":63,"n_cols":13,"rows_kept":63,"cut":false,"hidden":false,"merged":[]}
[]
["Round 5 Draw",null,{"$f":"Results!B3","v":0}]
[null,null,{"$f":"Results!B4","v":"Open Theme"}]
[null,null,null,null,null,null,null,null,null,null,null,null,"VALID?"]
[null,{"$f":"Results!A8","v":0},{"$f":"Results!C8","v":0},{"$f":"Results!B8","v":0},{"$f":"Results!D8","v":0},{"$f":"Results!G8","v":""},"- vs -",{"$f":"VLOOKUP(B5,Results!$A$8:BF59,58,FALSE)","v":{"$error":"#N/A"}},{"$f":"VLOOKUP(H5,Results!A$8:G60,3,FALSE)","v":{"$error":"#N/A"}},{"$f":"VLOOKUP(H5,Results!$A$8:G60,2,FALSE)","v":{"$error":"#N/A"}},{"$f":"VLOOKUP(H5,Results!$A$8:G60,4,FALSE)","v":{"$error":"#N/A"}},{"$f":"VLOOKUP(H5,Results!$A$8:G60,7,FALSE)","v":{"$error":"#N/A"}},{"$f":"VLOOKUP(H5,$B$4:B5,1,FALSE)","v":{"$error":"#N/A"}}]
[null,{"$f":"Results!A9","v":0},{"$f":"Results!C9","v":0},{"$f":"Results!B9","v":0},{"$f":"Results!D9","v":0},{"$f":"Results!G9","v":""},"- vs -",{"$f":"VLOOKUP(B6,Results!$A$8:BF60,58,FALSE)","v":{"$error":"#N/A"}},{"$f":"VLOOKUP(H6,Results!A$8:G61,3,FALSE)","v":{"$error":"#N/A"}},{"$f":"VLOOKUP(H6,Results!$A$8:G61,2,FALSE)","v":{"$error":"#N/A"}},{"$f":"VLOOKUP(H6,Results!$A$8:G61,4,FALSE)","v":{"$error":"#N/A"}},{"$f":"VLOOKUP(H6,Results!$A$8:G61,7,FALSE)","v":{"$error":"#N/A"}},{"$f":"VLOOKUP(H6,$B$4:B6,1,FALSE)","v":{"$error":"#N/A"}}]
{"$rows_left_out":58}
{"sheet":"Standings","index":17,"n_rows":56,"n_cols":15,"rows_kept":56,"cut":false,"hidden":false,"merged":[[2,8,2,9],[2,11,2,13],[2,1,2,4]]}
[]
[]
[null,{"$f":"Results!B3","v":0},null,null,null,null,{"$f":"Results!E3","v":"00:00:00"},null,{"$f":"Results!B4","v":"Open Theme"},null,null,"Final Standings"]
[]
[null,"Position","Name",null,"Club","Points","Army","Round 1","Round 2","Round 3","Round 4","Round 5","Round 6","Round 7","Round 8"]
[null,1,{"$f":"Results!C8","v":0},{"$f":"Results!B8","v":0},{"$f":"Results!D8","v":0},{"$f":"Results!E8","v":0},{"$f":"Results!G8","v":""},{"$f":"Results!L8","v":0},{"$f":"Results!S8","v":0},{"$f":"Results!Z8","v":0},{"$f":"Results!AG8","v":0},{"$f":"Results!AN8","v":0},{"$f":"Results!AU8","v":0},{"$f":"Results!BB8","v":0},{"$f":"Results!BI8","v":0}]
{"$rows_left_out":50}