{"text_format":"3","workbook":"xlsx","n_sheets":19,"sheets":["Results","Instructions","Round Draws","Armies","Module1","Module2","Module3","Module4","Module5","Round 1","Round 2","Round 3","Round 4","Round 5","Round 6","Round 7","Round 8","Round 9","Standings"],"not_rendered":{"images":19,"macros":1,"defined_names":9,"comments":1},"unopened":[{"sheet":"Module1","index":4,"reason":"part_missing"},{"sheet":"Module2","index":5,"reason":"part_missing"},{"sheet":"Module3","index":6,"reason":"part_missing"},{"sheet":"Module4","index":7,"reason":"part_missing"},{"sheet":"Module5","index":8,"reason":"part_missing"}],"read":"whole","date_system":"1900"}

{"sheet":"Results","index":0,"n_rows":139,"n_cols":75,"rows_kept":139,"merged":[[1,72,1,74],[2,1,2,2],[2,4,2,5],[3,1,3,2],[3,4,3,5]]}
["V4.0",null,null,"L'Art de la Guerre - Result Sheet"]
[{"$nulls":72},"Umpire Zone"]
["Tournament",null,null,"Date",null,null,"# Players (8 - 100)"]
["Theme","Classical Period",null,"Country","UK",null,"# Rounds (3 - 9)"]
[]
[{"$nulls":11},"Rnd 1",{"$nulls":6},"Rnd 2",{"$nulls":6},"Rnd 3",{"$nulls":6},"Rnd 4",{"$nulls":6},"Rnd 5",{"$nulls":6},"Rnd 6",{"$nulls":6},"Rnd 7",{"$nulls":6},"Rnd 8",{"$nulls":6},"Rnd 9",{"$nulls":4},"Opponents","Ex-Aequo","Ajustment"]
{"$rows_left_out":125}
{"sheet":"Instructions","index":1,"n_rows":27,"n_cols":1,"rows_kept":27}
["L'Art de la Guerre"]
["The results excel file V4"]
[]
["The excel file is used to help to pair up and to record Tournament results for L'Art de la Guerre. "]
["Using this spreadsheet allows the Tournament Organiser to submit the results for automatic inclusion in the global tournament database. This generates ELO rankings for players across the world."]
[]
{"$rows_left_out":22}
{"sheet":"Round Draws","index":2,"n_rows":2,"n_cols":2,"rows_kept":2,"hidden":true}
[]
[null,"Pairing of the round 1"]

{"sheet":"Armies","index":3,"n_rows":300,"n_cols":3,"rows_kept":300}
[1,"Sumer and Akkad","Sumer and Akkad"]
[2,"Sumerian Successor","Sumerian Successor"]
[3,"Amorite Highlanders","Amorite Highlanders"]
[4,"Elamite","Elamite"]
[5,"Old Assyrian and Babylonian","Old Assyrian and Babylonian"]
[6,"Kassite Babylonian","Kassite Babylonian"]
{"$rows_left_out":295}
{"sheet":"Round 1","index":9,"n_rows":100,"n_cols":13,"rows_kept":100}
[]
["Round 1 Draw",null,{"$f":"Results!B3","v":0}]
[null,null,{"$f":"Results!B4","v":"Classical Period"}]
[{"$nulls":12},"VALID?"]
[null,{"$f":"Results!A8","v":0},{"$f":"Results!C8","v":0},{"$f":"Results!B8","v":0},{"$f":"Results!D8","v":0},{"$f":"Results!G8","v":""},"- vs -",{"$f":"VLOOKUP(B5,Results!$A$8:$AG$104,9,)","v":{"$error":"#N/A"}},{"$f":"VLOOKUP(H5,Results!A$8:$G$104,3,FALSE)","v":{"$error":"#N/A"}},{"$f":"VLOOKUP(H5,Results!$A$8:$G$104,2,FALSE)","v":{"$error":"#N/A"}},{"$f":"VLOOKUP(H5,Results!$A$8:$G$104,4,FALSE)","v":{"$error":"#N/A"}},{"$f":"VLOOKUP(H5,Results!$A$8:$G$104,7,FALSE)","v":{"$error":"#N/A"}},{"$f":"VLOOKUP(H5,$B$5:B5,1,FALSE)","v":{"$error":"#N/A"}}]
[null,{"$f":"Results!A9","v":0},{"$f":"Results!C9","v":0},{"$f":"Results!B9","v":0},{"$f":"Results!D9","v":0},{"$f":"Results!G9","v":""},"- vs -",{"$f":"VLOOKUP(B6,Results!$A$8:$AG$104,9,)","v":{"$error":"#N/A"}},{"$f":"VLOOKUP(H6,Results!A$8:$G$104,3,FALSE)","v":{"$error":"#N/A"}},{"$f":"VLOOKUP(H6,Results!$A$8:$G$104,2,FALSE)","v":{"$error":"#N/A"}},{"$f":"VLOOKUP(H6,Results!$A$8:$G$104,4,FALSE)","v":{"$error":"#N/A"}},{"$f":"VLOOKUP(H6,Results!$A$8:$G$104,7,FALSE)","v":{"$error":"#N/A"}},{"$f":"VLOOKUP(H6,$B$5:B6,1,FALSE)","v":{"$error":"#N/A"}}]
{"$rows_left_out":95}
{"sheet":"Round 2","index":10,"n_rows":104,"n_cols":13,"rows_kept":104}
[]
["Round 2 Draw",null,{"$f":"Results!B3","v":0}]
["Table",null,{"$f":"Results!B4","v":"Classical Period"}]
[{"$nulls":12},"VALID?"]
[null,{"$f":"Results!A8","v":0},{"$f":"Results!C8","v":0},{"$f":"Results!B8","v":0},{"$f":"Results!D8","v":0},{"$f":"Results!G8","v":""},"- vs -",{"$f":"VLOOKUP(B5,Results!$A$8:$AG$104,16,FALSE)","v":{"$error":"#N/A"}},{"$f":"VLOOKUP(H5,Results!A$8:$G$104,3,FALSE)","v":{"$error":"#N/A"}},{"$f":"VLOOKUP(H5,Results!$A$8:$G$104,2,FALSE)","v":{"$error":"#N/A"}},{"$f":"VLOOKUP(H5,Results!$A$8:$G$104,4,FALSE)","v":{"$error":"#N/A"}},{"$f":"VLOOKUP(H5,Results!$A$8:$G$104,7,FALSE)","v":{"$error":"#N/A"}},{"$f":"VLOOKUP(H5,$B$4:B5,1,FALSE)","v":{"$error":"#N/A"}}]
[null,{"$f":"Results!A9","v":0},{"$f":"Results!C9","v":0},{"$f":"Results!B9","v":0},{"$f":"Results!D9","v":0},{"$f":"Results!G9","v":""},"- vs -",{"$f":"VLOOKUP(B6,Results!$A$8:$AG$104,16,FALSE)","v":{"$error":"#N/A"}},{"$f":"VLOOKUP(H6,Results!A$8:$G$104,3,FALSE)","v":{"$error":"#N/A"}},{"$f":"VLOOKUP(H6,Results!$A$8:$G$104,2,FALSE)","v":{"$error":"#N/A"}},{"$f":"VLOOKUP(H6,Results!$A$8:$G$104,4,FALSE)","v":{"$error":"#N/A"}},{"$f":"VLOOKUP(H6,Results!$A$8:$G$104,7,FALSE)","v":{"$error":"#N/A"}},{"$f":"VLOOKUP(H6,$B$4:B6,1,FALSE)","v":{"$error":"#N/A"}}]
{"$rows_left_out":99}
{"sheet":"Round 3","index":11,"n_rows":104,"n_cols":13,"rows_kept":104}
[]
["Round 3 Draw",null,null,{"$f":"Results!B3","v":0}]
[{"$nulls":3},{"$f":"Results!B4","v":"Classical Period"}]
[{"$nulls":12},"VALID?"]
[null,{"$f":"Results!A8","v":0},{"$f":"Results!C8","v":0},{"$f":"Results!B8","v":0},{"$f":"Results!D8","v":0},{"$f":"Results!G8","v":""},"- vs -",{"$f":"VLOOKUP(B5,Results!$A$8:$AG$60,23,FALSE)","v":{"$error":"#N/A"}},{"$f":"VLOOKUP(H5,Results!A$8:$G$60,3,FALSE)","v":{"$error":"#N/A"}},{"$f":"VLOOKUP(H5,Results!$A$8:$G$60,2,FALSE)","v":{"$error":"#N/A"}},{"$f":"VLOOKUP(H5,Results!$A$8:$G$60,4,FALSE)","v":{"$error":"#N/A"}},{"$f":"VLOOKUP(H5,Results!$A$8:$G$60,7,FALSE)","v":{"$error":"#N/A"}},{"$f":"VLOOKUP(H5,$B$4:B5,1,FALSE)","v":{"$error":"#N/A"}}]
[null,{"$f":"Results!A9","v":0},{"$f":"Results!C9","v":0},{"$f":"Results!B9","v":0},{"$f":"Results!D9","v":0},{"$f":"Results!G9","v":""},"- vs -",{"$f":"VLOOKUP(B6,Results!$A$8:$AG$60,23,FALSE)","v":{"$error":"#N/A"}},{"$f":"VLOOKUP(H6,Results!A$8:$G$60,3,FALSE)","v":{"$error":"#N/A"}},{"$f":"VLOOKUP(H6,Results!$A$8:$G$60,2,FALSE)","v":{"$error":"#N/A"}},{"$f":"VLOOKUP(H6,Results!$A$8:$G$60,4,FALSE)","v":{"$error":"#N/A"}},{"$f":"VLOOKUP(H6,Results!$A$8:$G$60,7,FALSE)","v":{"$error":"#N/A"}},{"$f":"VLOOKUP(H6,$B$4:B6,1,FALSE)","v":{"$error":"#N/A"}}]
{"$rows_left_out":99}
{"sheet":"Round 4","index":12,"n_rows":104,"n_cols":13,"rows_kept":104}
[]
[null,null,{"$f":"Results!B3","v":0},null,"Round 4 Draw"]
[null,null,{"$f":"Results!B4","v":"Classical Period"}]
[{"$nulls":12},"VALID?"]
[null,{"$f":"Results!A8","v":0},{"$f":"Results!C8","v":0},{"$f":"Results!B8","v":0},{"$f":"Results!D8","v":0},{"$f":"Results!G8","v":""},"- vs -",{"$f":"VLOOKUP(B5,Results!$A$8:$AG$60,30,FALSE)","v":{"$error":"#N/A"}},{"$f":"VLOOKUP(H5,Results!A$8:$G$60,3,FALSE)","v":{"$error":"#N/A"}},{"$f":"VLOOKUP(H5,Results!$A$8:$G$60,2,FALSE)","v":{"$error":"#N/A"}},{"$f":"VLOOKUP(H5,Results!$A$8:$G$60,4,FALSE)","v":{"$error":"#N/A"}},{"$f":"VLOOKUP(H5,Results!$A$8:$G$60,7,FALSE)","v":{"$error":"#N/A"}},{"$f":"VLOOKUP(H5,$B$4:B5,1,FALSE)","v":{"$error":"#N/A"}}]
[null,{"$f":"Results!A9","v":0},{"$f":"Results!C9","v":0},{"$f":"Results!B9","v":0},{"$f":"Results!D9","v":0},{"$f":"Results!G9","v":""},"- vs -",{"$f":"VLOOKUP(B6,Results!$A$8:$AG$60,30,FALSE)","v":{"$error":"#N/A"}},{"$f":"VLOOKUP(H6,Results!A$8:$G$60,3,FALSE)","v":{"$error":"#N/A"}},{"$f":"VLOOKUP(H6,Results!$A$8:$G$60,2,FALSE)","v":{"$error":"#N/A"}},{"$f":"VLOOKUP(H6,Results!$A$8:$G$60,4,FALSE)","v":{"$error":"#N/A"}},{"$f":"VLOOKUP(H6,Results!$A$8:$G$60,7,FALSE)","v":{"$error":"#N/A"}},{"$f":"VLOOKUP(H6,$B$4:B6,1,FALSE)","v":{"$error":"#N/A"}}]
{"$rows_left_out":99}
{"sheet":"Round 5","index":13,"n_rows":101,"n_cols":13,"rows_kept":101}
[{"$nulls":4},"Round 5 Draw"]
[null,null,{"$f":"Results!B3","v":0}]
[null,null,{"$f":"Results!B4","v":"Classical Period"}]
[{"$nulls":12},"VALID?"]
[null,{"$f":"Results!A8","v":0},{"$f":"Results!C8","v":0},{"$f":"Results!B8","v":0},{"$f":"Results!D8","v":0},{"$f":"Results!G8","v":""},"- vs -",{"$f":"VLOOKUP(B5,Results!$A$8:$AK$104,37,FALSE)","v":{"$error":"#N/A"}},{"$f":"VLOOKUP(H5,Results!A$8:$G$104,3,FALSE)","v":{"$error":"#N/A"}},{"$f":"VLOOKUP(H5,Results!$A$8:$G$104,2,FALSE)","v":{"$error":"#N/A"}},{"$f":"VLOOKUP(H5,Results!$A$8:$G$104,4,FALSE)","v":{"$error":"#N/A"}},{"$f":"VLOOKUP(H5,Results!$A$8:$G$104,7,FALSE)","v":{"$error":"#N/A"}},{"$f":"VLOOKUP(H5,$B$4:B5,1,FALSE)","v":{"$error":"#N/A"}}]
[null,{"$f":"Results!A9","v":0},{"$f":"Results!C9","v":0},{"$f":"Results!B9","v":0},{"$f":"Results!D9","v":0},{"$f":"Results!G9","v":""},"- vs -",{"$f":"VLOOKUP(B6,Results!$A$8:$AK$104,37,FALSE)","v":{"$error":"#N/A"}},{"$f":"VLOOKUP(H6,Results!A$8:$G$104,3,FALSE)","v":{"$error":"#N/A"}},{"$f":"VLOOKUP(H6,Results!$A$8:$G$104,2,FALSE)","v":{"$error":"#N/A"}},{"$f":"VLOOKUP(H6,Results!$A$8:$G$104,4,FALSE)","v":{"$error":"#N/A"}},{"$f":"VLOOKUP(H6,Results!$A$8:$G$104,7,FALSE)","v":{"$error":"#N/A"}},{"$f":"VLOOKUP(H6,$B$4:B6,1,FALSE)","v":{"$error":"#N/A"}}]
{"$rows_left_out":96}
{"sheet":"Round 6","index":14,"n_rows":69,"n_cols":13,"rows_kept":69}
[{"$nulls":4},"Round 6 Draw"]
[null,null,{"$f":"Results!B3","v":0}]
[null,null,{"$f":"Results!B4","v":"Classical Period"}]
[{"$nulls":12},"VALID?"]
[null,{"$f":"Results!A8","v":0},{"$f":"Results!C8","v":0},{"$f":"Results!B8","v":0},{"$f":"Results!D8","v":0},{"$f":"Results!G8","v":""},"- vs -",{"$f":"VLOOKUP(B5,Results!$A$8:$AR$104,44,FALSE)","v":{"$error":"#N/A"}},{"$f":"VLOOKUP(H5,Results!A$8:$G$104,3,FALSE)","v":{"$error":"#N/A"}},{"$f":"VLOOKUP(H5,Results!$A$8:$G$104,2,FALSE)","v":{"$error":"#N/A"}},{"$f":"VLOOKUP(H5,Results!$A$8:$G$104,4,FALSE)","v":{"$error":"#N/A"}},{"$f":"VLOOKUP(H5,Results!$A$8:$G$104,7,FALSE)","v":{"$error":"#N/A"}},{"$f":"VLOOKUP(H5,$B$4:B5,1,FALSE)","v":{"$error":"#N/A"}}]
[null,{"$f":"Results!A9","v":0},{"$f":"Results!C9","v":0},{"$f":"Results!B9","v":0},{"$f":"Results!D9","v":0},{"$f":"Results!G9","v":""},"- vs -",{"$f":"VLOOKUP(B6,Results!$A$8:$AR$104,44,FALSE)","v":{"$error":"#N/A"}},{"$f":"VLOOKUP(H6,Results!A$8:$G$104,3,FALSE)","v":{"$error":"#N/A"}},{"$f":"VLOOKUP(H6,Results!$A$8:$G$104,2,FALSE)","v":{"$error":"#N/A"}},{"$f":"VLOOKUP(H6,Results!$A$8:$G$104,4,FALSE)","v":{"$error":"#N/A"}},{"$f":"VLOOKUP(H6,Results!$A$8:$G$104,7,FALSE)","v":{"$error":"#N/A"}},{"$f":"VLOOKUP(H6,$B$4:B6,1,FALSE)","v":{"$error":"#N/A"}}]
{"$rows_left_out":64}
{"sheet":"Round 7","index":15,"n_rows":69,"n_cols":13,"rows_kept":69}
[{"$nulls":4},"Round 7 Draw"]
[null,null,{"$f":"Results!B3","v":0}]
[null,null,{"$f":"Results!B4","v":"Classical Period"}]
[{"$nulls":12},"VALID?"]
[null,{"$f":"Results!A8","v":0},{"$f":"Results!C8","v":0},{"$f":"Results!B8","v":0},{"$f":"Results!D8","v":0},{"$f":"Results!G8","v":""},"- vs -",{"$f":"VLOOKUP(B5,Results!$A$8:$AY$104,51,FALSE)","v":{"$error":"#N/A"}},{"$f":"VLOOKUP(H5,Results!A$8:$G$104,3,FALSE)","v":{"$error":"#N/A"}},{"$f":"VLOOKUP(H5,Results!$A$8:$G$104,2,FALSE)","v":{"$error":"#N/A"}},{"$f":"VLOOKUP(H5,Results!$A$8:$G$104,4,FALSE)","v":{"$error":"#N/A"}},{"$f":"VLOOKUP(H5,Results!$A$8:$G$104,7,FALSE)","v":{"$error":"#N/A"}},{"$f":"VLOOKUP(H5,$B$4:B5,1,FALSE)","v":{"$error":"#N/A"}}]
[null,{"$f":"Results!A9","v":0},{"$f":"Results!C9","v":0},{"$f":"Results!B9","v":0},{"$f":"Results!D9","v":0},{"$f":"Results!G9","v":""},"- vs -",{"$f":"VLOOKUP(B6,Results!$A$8:$AY$104,51,FALSE)","v":{"$error":"#N/A"}},{"$f":"VLOOKUP(H6,Results!A$8:$G$104,3,FALSE)","v":{"$error":"#N/A"}},{"$f":"VLOOKUP(H6,Results!$A$8:$G$104,2,FALSE)","v":{"$error":"#N/A"}},{"$f":"VLOOKUP(H6,Results!$A$8:$G$104,4,FALSE)","v":{"$error":"#N/A"}},{"$f":"VLOOKUP(H6,Results!$A$8:$G$104,7,FALSE)","v":{"$error":"#N/A"}},{"$f":"VLOOKUP(H6,$B$4:B6,1,FALSE)","v":{"$error":"#N/A"}}]
{"$rows_left_out":64}
{"sheet":"Round 8","index":16,"n_rows":104,"n_cols":13,"rows_kept":104}
[{"$nulls":4},"Round 8 Draw"]
[null,null,{"$f":"Results!B3","v":0}]
[null,null,{"$f":"Results!B4","v":"Classical Period"}]
[{"$nulls":12},"VALID?"]
[null,{"$f":"Results!A8","v":0},{"$f":"Results!C8","v":0},{"$f":"Results!B8","v":0},{"$f":"Results!D8","v":0},{"$f":"Results!G8","v":""},"- vs -",{"$f":"VLOOKUP(B5,Results!$A$8:$BF$104,58,FALSE)","v":{"$error":"#N/A"}},{"$f":"VLOOKUP(H5,Results!A$8:$G$104,3,FALSE)","v":{"$error":"#N/A"}},{"$f":"VLOOKUP(H5,Results!$A$8:$G$104,2,FALSE)","v":{"$error":"#N/A"}},{"$f":"VLOOKUP(H5,Results!$A$8:$G$104,4,FALSE)","v":{"$error":"#N/A"}},{"$f":"VLOOKUP(H5,Results!$A$8:$G$104,7,FALSE)","v":{"$error":"#N/A"}},{"$f":"VLOOKUP(H5,$B$4:B5,1,FALSE)","v":{"$error":"#N/A"}}]
[null,{"$f":"Results!A9","v":0},{"$f":"Results!C9","v":0},{"$f":"Results!B9","v":0},{"$f":"Results!D9","v":0},{"$f":"Results!G9","v":""},"- vs -",{"$f":"VLOOKUP(B6,Results!$A$8:$BF$104,58,FALSE)","v":{"$error":"#N/A"}},{"$f":"VLOOKUP(H6,Results!A$8:$G$104,3,FALSE)","v":{"$error":"#N/A"}},{"$f":"VLOOKUP(H6,Results!$A$8:$G$104,2,FALSE)","v":{"$error":"#N/A"}},{"$f":"VLOOKUP(H6,Results!$A$8:$G$104,4,FALSE)","v":{"$error":"#N/A"}},{"$f":"VLOOKUP(H6,Results!$A$8:$G$104,7,FALSE)","v":{"$error":"#N/A"}},{"$f":"VLOOKUP(H6,$B$4:B6,1,FALSE)","v":{"$error":"#N/A"}}]
{"$rows_left_out":99}
{"sheet":"Round 9","index":17,"n_rows":69,"n_cols":13,"rows_kept":69}
[{"$nulls":4},"Round 9 Draw"]
[null,null,{"$f":"Results!B3","v":0}]
[null,null,{"$f":"Results!B4","v":"Classical Period"}]
[{"$nulls":12},"VALID?"]
[null,{"$f":"Results!A8","v":0},{"$f":"Results!C8","v":0},{"$f":"Results!B8","v":0},{"$f":"Results!D8","v":0},{"$f":"Results!G8","v":""},"- vs -",{"$f":"VLOOKUP(B5,Results!$A$8:$BM$104,65,FALSE)","v":{"$error":"#N/A"}},{"$f":"VLOOKUP(H5,Results!A$8:$G$104,3,FALSE)","v":{"$error":"#N/A"}},{"$f":"VLOOKUP(H5,Results!$A$8:$G$104,2,FALSE)","v":{"$error":"#N/A"}},{"$f":"VLOOKUP(H5,Results!$A$8:$G$104,4,FALSE)","v":{"$error":"#N/A"}},{"$f":"VLOOKUP(H5,Results!$A$8:$G$104,7,FALSE)","v":{"$error":"#N/A"}},{"$f":"VLOOKUP(H5,$B$4:B5,1,FALSE)","v":{"$error":"#N/A"}}]
[null,{"$f":"Results!A9","v":0},{"$f":"Results!C9","v":0},{"$f":"Results!B9","v":0},{"$f":"Results!D9","v":0},{"$f":"Results!G9","v":""},"- vs -",{"$f":"VLOOKUP(B6,Results!$A$8:$BM$104,65,FALSE)","v":{"$error":"#N/A"}},{"$f":"VLOOKUP(H6,Results!A$8:$G$104,3,FALSE)","v":{"$error":"#N/A"}},{"$f":"VLOOKUP(H6,Results!$A$8:$G$104,2,FALSE)","v":{"$error":"#N/A"}},{"$f":"VLOOKUP(H6,Results!$A$8:$G$104,4,FALSE)","v":{"$error":"#N/A"}},{"$f":"VLOOKUP(H6,Results!$A$8:$G$104,7,FALSE)","v":{"$error":"#N/A"}},{"$f":"VLOOKUP(H6,$B$4:B6,1,FALSE)","v":{"$error":"#N/A"}}]
{"$rows_left_out":64}
{"sheet":"Standings","index":18,"n_rows":52,"n_cols":15,"rows_kept":52}
[]
["Placing",{"$f":"Results!C7","v":"First Name"},{"$f":"Results!B7","v":"Surname"},{"$f":"Results!D7","v":"Club"},{"$f":"Results!E7","v":"Points"},{"$f":"Results!G7","v":"Army"},"R1","R2","R3","R4","R5","R6","R7","R8","R9"]
[{"$f":"IF(E3>1,1,\"\")","v":""},{"$f":"Results!C8","v":0},{"$f":"Results!B8","v":0},{"$f":"Results!D8","v":0},{"$f":"Results!E8","v":0},{"$f":"Results!G8","v":""},{"$f":"Results!L8","v":0},{"$f":"Results!S8","v":0},{"$f":"Results!Z8","v":0},{"$f":"Results!AG8","v":0},{"$f":"Results!AN8","v":0},{"$f":"Results!AU8","v":0},{"$f":"Results!BB8","v":0},{"$f":"Results!BI8","v":0},{"$f":"Results!BP8","v":0}]
[{"$f":"IF(E4>1,A3+1,\"\")","v":""},{"$f":"Results!C9","v":0},{"$f":"Results!B9","v":0},{"$f":"Results!D9","v":0},{"$f":"Results!E9","v":0},{"$f":"Results!G9","v":""},{"$f":"Results!L9","v":0},{"$f":"Results!S9","v":0},{"$f":"Results!Z9","v":0},{"$f":"Results!AG9","v":0},{"$f":"Results!AN9","v":0},{"$f":"Results!AU9","v":0},{"$f":"Results!BB9","v":0},{"$f":"Results!BI9","v":0},{"$f":"Results!BP9","v":0}]
[{"$f":"IF(E5>1,A4+1,\"\")","v":""},{"$f":"Results!C10","v":0},{"$f":"Results!B10","v":0},{"$f":"Results!D10","v":0},{"$f":"Results!E10","v":0},{"$f":"Results!G10","v":""},{"$f":"Results!L10","v":0},{"$f":"Results!S10","v":0},{"$f":"Results!Z10","v":0},{"$f":"Results!AG10","v":0},{"$f":"Results!AN10","v":0},{"$f":"Results!AU10","v":0},{"$f":"Results!BB10","v":0},{"$f":"Results!BI10","v":0},{"$f":"Results!BP10","v":0}]
["",{"$f":"Results!C11","v":0},{"$f":"Results!B11","v":0},{"$f":"Results!D11","v":0},{"$f":"Results!E11","v":0},{"$f":"Results!G11","v":""},{"$f":"Results!L11","v":0},{"$f":"Results!S11","v":0},{"$f":"Results!Z11","v":0},{"$f":"Results!AG11","v":0},{"$f":"Results!AN11","v":0},{"$f":"Results!AU11","v":0},{"$f":"Results!BB11","v":0},{"$f":"Results!BI11","v":0},{"$f":"Results!BP11","v":0}]
{"$rows_left_out":46}